{"text_format":"1","workbook":"xlsx","n_sheets":9,"sheets":["Saatler (2)","BİLGİ GİRİŞİ","GÖREVLENDİRME ONAYI","Bildirim İçin","Yolluk Bildirimi","YEVİMEYELER","Sayfa1","Saatler","GORLIS"],"not_rendered":{"charts":0,"images":0,"macros":1,"external_links":0,"defined_names":4,"comments":6,"pivot_tables":0},"unopened":[],"bounds":{"document_bytes":16777216,"sheet_cells":100000,"rows_first":2000,"rows_last":500,"rows_between":2000,"halvings":0,"cell_chars":16384,"cell_head_chars":4096},"cells_cut":0,"cells_raw":0,"read":"whole","date_system":"1900"}

{"sheet":"Saatler (2)","index":0,"n_rows":36,"n_cols":13,"rows_kept":36,"cut":false,"hidden":false,"merged":[[30,1,30,12],[33,1,33,12],[23,0,23,12],[24,0,35,0],[32,1,32,12],[35,1,35,12],[31,1,31,12],[34,1,34,12],[29,1,29,12],[25,1,25,12],[28,1,28,12],[3,6,8,6],[27,1,27,12],[2,0,2,4],[2,6,2,10],[3,0,8,0],[24,1,24,12],[10,0,22,0],[10,6,22,6],[26,1,26,12]]}
[]
[]
["Çıkış Saati Aşağıdaki Zaman Dilimi İçersinde",null,null,null,null,null,"Dönüş Saati Aşağıdaki Zaman Dilimi İçersinde İse",null,null,null,null,null,"Yevmiye"]
[null,"00:01:00","ile","12:59:00","Arası",null,null,"00:02:00","ile","12:59:00","Arası",null,0]
[]
[null,"00:01:00","ile","12:59:00","Arası",null,null,"13:01:00","ile","18:59:00","Arası",null,0.33333333333333331]
[]
[null,"00:01:00","ile","12:59:00","Arası",null,null,"19:01:00","ile","19:59:00","Arası",null,0.66666666666666663]
[]
[]
{"$rows_left_out":27}
{"sheet":"BİLGİ GİRİŞİ","index":1,"n_rows":37,"n_cols":16,"rows_kept":37,"cut":false,"hidden":false,"merged":[[24,3,24,4],[2,3,2,4],[8,0,8,1],[0,15,4,15],[12,15,14,15],[16,15,18,15],[5,15,7,15],[8,15,11,15],[20,3,20,4]]}
[null,null,null,null,null,null,null,null,null,null,null,null,null,null,null,"Not:1-Herhangibir nedenle yapılacak olan görevlendirmelerde,  göreve gitmeden önce bu sayfa üzerinden bilgi girişi yapılarak \"GÖREVLENDİRME ONAYI\"  hazırlanır."]
[]
[null,null,null,"Görevlendirme Formu Giriş Ekranı"]
[]
[null,null,null,"Evrak Tarihi"]
[null,null,null,{"$f":"+'GÖREVLENDİRME ONAYI'!C12","v":"Adı Soyadı"},"dkdkdk",null,null,null,null,null,null,null,null,null,null,"2-   Görev Dönüşünde,Çıktısı Alınan Görevlendirme Onayı Üzerine Dönüşe Ait Bilgiler KALEMLE Yazılacaktır."]
[null,null,null,{"$f":"+'GÖREVLENDİRME ONAYI'!E12","v":"Görevi"},"dsjasoj"]
[null,null,null,{"$f":"+'GÖREVLENDİRME ONAYI'!G11","v":"Kadro  Der"}]
[{"$f":"NOW()","v":"2021-11-16T17:28:15.530"},null,null,"Ek Göstergeniz",null,null,null,null,null,null,null,null,null,null,null,"3- Bilgi Girişi sayfasında bulunan kayıt butunu,  yazılan bilgileri \"BİLDİRİM İÇİN\"  sayfasına kaydeder. Kaydedilen bilgiler Görev dönüşünde Geçici Görev Yoluğu Bildirimi düzenlenmesi için kullanılır."]
[{"$f":"IF(E9>=3000,0,IF(ISERROR(VLOOKUP(E8,YEVİMEYELER!H7:I21,2,FALSE)),0,VLOOKUP(E8,YEVİMEYELER!H7:I21,2,FALSE)))","v":0},{"$f":"IF(E9<=0,0,IF(ISERROR(VLOOKUP(E9,YEVİMEYELER!K7:L41,2,FALSE)),0,VLOOKUP(E9,YEVİMEYELER!K7:L41,2,FALSE)))","v":0},null,{"$f":"+'GÖREVLENDİRME ONAYI'!H11","v":"Yevmiye Tutarı"},{"$f":"IF(B10<=0,+A10,+B10)","v":0}]
{"$rows_left_out":28}
{"sheet":"GÖREVLENDİRME ONAYI","index":2,"n_rows":52,"n_cols":18,"rows_kept":52,"cut":false,"hidden":false,"merged":[[23,2,26,3],[15,4,19,10],[12,8,14,10],[15,2,19,3],[12,7,14,7],[12,2,14,3],[12,4,14,5],[25,9,26,9],[24,6,24,7],[26,6,26,7],[6,3,6,5],[12,6,13,6],[20,2,22,3],[20,4,22,10],[1,4,1,8],[10,7,11,7],[6,8,6,9],[8,3,8,8],[11,2,11,3],[11,4,11,5],[2,3,2,9],[3,3,3,9],[10,6,11,6],[10,8,11,10],[48,4,48,7],[45,4,45,7],[25,8,26,8],[23,6,23,7],[32,2,35,10],[29,6,30,7],[29,2,30,3],[27,2,28,3],[46,4,47,8],[38,8,38,10],[29,8,30,10],[44,4,44,7],[40,4,40,7],[41,4,41,7],[29,4,30,5],[37,8,37,10],[27,4,28,5],[27,6,28,7],[27,8,28,10],[23,4,26,4],[23,9,24,9],[23,5,26,5],[25,6,25,7],[23,8,24,8]]}
[]
[null,null,null,null,"T.C."]
[null,null,null,"AFYON KOCATEPE ÜNİVERSİTESİ REKTÖRLÜĞÜ",null,null,null,null,null,null,null,null,null,null,null," "]
[null,null,null,{"$f":"+'BİLGİ GİRİŞİ'!E12","v":0},null,null,null,null,null,null,null,null,null," "]
[]
[null,null,"SAYI      :",null," /"]
[null,null,"KONU    :","GÖREVLENDİRME",null,null,null,null,{"$f":"+'BİLGİ GİRİŞİ'!E5","v":"00:00:00"},null,null,null,null,null,null," "]
[]
[null,null,null,"Geçici Görevle Görevlendirilen Üniversitemiz Görevlisi"]
[]
{"$rows_left_out":43}
{"sheet":"Bildirim İçin","index":3,"n_rows":148,"n_cols":27,"rows_kept":148,"cut":false,"hidden":false,"merged":[]}
[]
[null,"Sıra No","Evrak Tarihi","Adı Soyadı","Görevi","Kadro / Derece","Yevmiye Tutarı","Harcirah Ödeneği Bütçe Tertibi","Gittiği Yerdeki Görevin Mahiyeti","Geçici görevle görevlendirildiği şehir.","Gidiş Tarihi","                    Dönüş Tarihi","Harcirah için Geçen Süre (Gün)","Gidiş Saati","Dönüş Saati","Bindiği vasıtanın cinsi"," Resmi vasıta ise  plaka nosu","Şöförün adı ve soyadı","Otobüs Ücreti","Yer","Otel Giriş Tarihi","Otel Çıkış Tarihi","Ödenecek Süre","Otel Fatura Tutarı","Ödenebilecek Azami Tutar TL","Taksi Ücreti","Ek Göst."]
[null,{"$f":"IF(GORLIS!B4=\"\",\"\",1)","v":1},{"$f":"IF(GORLIS!B4=\"\",\"\",+GORLIS!B4)","v":"00:00:00"},{"$f":"IF(GORLIS!C4=\"\",\"\",+GORLIS!C4)","v":"dkdkdk"},{"$f":"IF(GORLIS!D4=\"\",\"\",+GORLIS!D4)","v":"dsjasoj"},{"$f":"IF(GORLIS!E4=\"\",\"\",+GORLIS!E4)","v":""},{"$f":"IF(GORLIS!F4=\"\",\"\",+GORLIS!F4)","v":0},{"$f":"IF(GORLIS!G4=\"\",\"\",+GORLIS!G4)","v":"00:00:00"},{"$f":"IF(GORLIS!H4=\"\",\"\",+GORLIS!H4)","v":0},{"$f":"IF(GORLIS!I4=\"\",\"\",+GORLIS!I4)","v":0},{"$f":"IF(GORLIS!J4=\"\",\"\",+GORLIS!J4)","v":"00:00:00"},null,null,{"$f":"IF(GORLIS!M4=\"\",\"\",+GORLIS!M4)","v":"00:00:00"},null,{"$f":"IF(GORLIS!O4=\"\",\"\",+GORLIS!O4)","v":0},{"$f":"IF(GORLIS!P4=\"\",\"\",+GORLIS!P4)","v":0},{"$f":"IF(GORLIS!Q4=\"\",\"\",+GORLIS!Q4)","v":0},{"$f":"IF(GORLIS!R4=\"\",\"\",+GORLIS!R4)","v":0},{"$f":"IF(J3=\"\",\"\",CONCATENATE(GORLIS!T4,\"--\",J3))","v":"0--0"},null,null,{"$f":"IF(V3-U3>M3,+M3,IF((V3-U3)>10,10,(V3-U3)))","v":0},null,{"$f":"IF(G3=\"\",0,IF(W3<=0,0,IF(W3*((G3*0.5)+G3)>=X3,+X3,W3*((G3*0.5)+G3))))","v":0},null,{"$f":"IF(GORLIS!S4=\"\",\"\",+GORLIS!S4)","v":""}]
[null,{"$f":"IF(GORLIS!B5=\"\",\"\",B3+1)","v":2},{"$f":"IF(GORLIS!B5=\"\",\"\",+GORLIS!B5)","v":"00:00:00"},{"$f":"IF(GORLIS!C5=\"\",\"\",+GORLIS!C5)","v":"dkdkdk"},{"$f":"IF(GORLIS!D5=\"\",\"\",+GORLIS!D5)","v":"dsjasoj"},{"$f":"IF(GORLIS!E5=\"\",\"\",+GORLIS!E5)","v":""},{"$f":"IF(GORLIS!F5=\"\",\"\",+GORLIS!F5)","v":0},{"$f":"IF(GORLIS!G5=\"\",\"\",+GORLIS!G5)","v":"00:00:00"},{"$f":"IF(GORLIS!H5=\"\",\"\",+GORLIS!H5)","v":0},{"$f":"IF(GORLIS!I5=\"\",\"\",+GORLIS!I5)","v":0},{"$f":"IF(GORLIS!J5=\"\",\"\",+GORLIS!J5)","v":"00:00:00"},null,null,{"$f":"IF(GORLIS!M5=\"\",\"\",+GORLIS!M5)","v":"00:00:00"},null,{"$f":"IF(GORLIS!O5=\"\",\"\",+GORLIS!O5)","v":0},{"$f":"IF(GORLIS!P5=\"\",\"\",+GORLIS!P5)","v":0},{"$f":"IF(GORLIS!Q5=\"\",\"\",+GORLIS!Q5)","v":0},{"$f":"IF(GORLIS!R5=\"\",\"\",+GORLIS!R5)","v":0},{"$f":"IF(J4=\"\",\"\",CONCATENATE(GORLIS!T5,\"--\",J4))","v":"0--0"},null,null,{"$f":"IF(V4-U4>M4,+M4,IF((V4-U4)>10,10,(V4-U4)))","v":0},null,{"$f":"IF(G4=\"\",0,IF(W4<=0,0,IF(W4*((G4*0.5)+G4)>=X4,+X4,W4*((G4*0.5)+G4))))","v":0},null,{"$f":"IF(GORLIS!S5=\"\",\"\",+GORLIS!S5)","v":""}]
[null,{"$f":"IF(GORLIS!B6=\"\",\"\",B4+1)","v":""},{"$f":"IF(GORLIS!B6=\"\",\"\",+GORLIS!B6)","v":""},{"$f":"IF(GORLIS!C6=\"\",\"\",+GORLIS!C6)","v":""},{"$f":"IF(GORLIS!D6=\"\",\"\",+GORLIS!D6)","v":""},{"$f":"IF(GORLIS!E6=\"\",\"\",+GORLIS!E6)","v":""},{"$f":"IF(GORLIS!F6=\"\",\"\",+GORLIS!F6)","v":""},{"$f":"IF(GORLIS!G6=\"\",\"\",+GORLIS!G6)","v":""},{"$f":"IF(GORLIS!H6=\"\",\"\",+GORLIS!H6)","v":""},{"$f":"IF(GORLIS!I6=\"\",\"\",+GORLIS!I6)","v":""},{"$f":"IF(GORLIS!J6=\"\",\"\",+GORLIS!J6)","v":""},null,null,{"$f":"IF(GORLIS!M6=\"\",\"\",+GORLIS!M6)","v":""},null,{"$f":"IF(GORLIS!O6=\"\",\"\",+GORLIS!O6)","v":""},{"$f":"IF(GORLIS!P6=\"\",\"\",+GORLIS!P6)","v":""},{"$f":"IF(GORLIS!Q6=\"\",\"\",+GORLIS!Q6)","v":""},{"$f":"IF(GORLIS!R6=\"\",\"\",+GORLIS!R6)","v":""},{"$f":"IF(J5=\"\",\"\",CONCATENATE(GORLIS!T6,\"--\",J5))","v":""},null,null,0,null,0,null,{"$f":"IF(GORLIS!S6=\"\",\"\",+GORLIS!S6)","v":""}]
[null,{"$f":"IF(GORLIS!B7=\"\",\"\",B5+1)","v":""},{"$f":"IF(GORLIS!B7=\"\",\"\",+GORLIS!B7)","v":""},{"$f":"IF(GORLIS!C7=\"\",\"\",+GORLIS!C7)","v":""},{"$f":"IF(GORLIS!D7=\"\",\"\",+GORLIS!D7)","v":""},{"$f":"IF(GORLIS!E7=\"\",\"\",+GORLIS!E7)","v":""},{"$f":"IF(GORLIS!F7=\"\",\"\",+GORLIS!F7)","v":""},{"$f":"IF(GORLIS!G7=\"\",\"\",+GORLIS!G7)","v":""},{"$f":"IF(GORLIS!H7=\"\",\"\",+GORLIS!H7)","v":""},{"$f":"IF(GORLIS!I7=\"\",\"\",+GORLIS!I7)","v":""},{"$f":"IF(GORLIS!J7=\"\",\"\",+GORLIS!J7)","v":""},null,null,{"$f":"IF(GORLIS!M7=\"\",\"\",+GORLIS!M7)","v":""},null,{"$f":"IF(GORLIS!O7=\"\",\"\",+GORLIS!O7)","v":""},{"$f":"IF(GORLIS!P7=\"\",\"\",+GORLIS!P7)","v":""},{"$f":"IF(GORLIS!Q7=\"\",\"\",+GORLIS!Q7)","v":""},{"$f":"IF(GORLIS!R7=\"\",\"\",+GORLIS!R7)","v":""},{"$f":"IF(J6=\"\",\"\",CONCATENATE(GORLIS!T7,\"--\",J6))","v":""},null,null,0,null,0,null,{"$f":"IF(GORLIS!S7=\"\",\"\",+GORLIS!S7)","v":""}]
[null,{"$f":"IF(GORLIS!B8=\"\",\"\",B6+1)","v":""},{"$f":"IF(GORLIS!B8=\"\",\"\",+GORLIS!B8)","v":""},{"$f":"IF(GORLIS!C8=\"\",\"\",+GORLIS!C8)","v":""},{"$f":"IF(GORLIS!D8=\"\",\"\",+GORLIS!D8)","v":""},{"$f":"IF(GORLIS!E8=\"\",\"\",+GORLIS!E8)","v":""},{"$f":"IF(GORLIS!F8=\"\",\"\",+GORLIS!F8)","v":""},{"$f":"IF(GORLIS!G8=\"\",\"\",+GORLIS!G8)","v":""},{"$f":"IF(GORLIS!H8=\"\",\"\",+GORLIS!H8)","v":""},{"$f":"IF(GORLIS!I8=\"\",\"\",+GORLIS!I8)","v":""},{"$f":"IF(GORLIS!J8=\"\",\"\",+GORLIS!J8)","v":""},null,null,{"$f":"IF(GORLIS!M8=\"\",\"\",+GORLIS!M8)","v":""},null,{"$f":"IF(GORLIS!O8=\"\",\"\",+GORLIS!O8)","v":""},{"$f":"IF(GORLIS!P8=\"\",\"\",+GORLIS!P8)","v":""},{"$f":"IF(GORLIS!Q8=\"\",\"\",+GORLIS!Q8)","v":""},{"$f":"IF(GORLIS!R8=\"\",\"\",+GORLIS!R8)","v":""},{"$f":"IF(J7=\"\",\"\",CONCATENATE(GORLIS!T8,\"--\",J7))","v":""},null,null,0,null,0,null,{"$f":"IF(GORLIS!S8=\"\",\"\",+GORLIS!S8)","v":""}]
[null,{"$f":"IF(GORLIS!B9=\"\",\"\",B7+1)","v":""},{"$f":"IF(GORLIS!B9=\"\",\"\",+GORLIS!B9)","v":""},{"$f":"IF(GORLIS!C9=\"\",\"\",+GORLIS!C9)","v":""},{"$f":"IF(GORLIS!D9=\"\",\"\",+GORLIS!D9)","v":""},{"$f":"IF(GORLIS!E9=\"\",\"\",+GORLIS!E9)","v":""},{"$f":"IF(GORLIS!F9=\"\",\"\",+GORLIS!F9)","v":""},{"$f":"IF(GORLIS!G9=\"\",\"\",+GORLIS!G9)","v":""},{"$f":"IF(GORLIS!H9=\"\",\"\",+GORLIS!H9)","v":""},{"$f":"IF(GORLIS!I9=\"\",\"\",+GORLIS!I9)","v":""},{"$f":"IF(GORLIS!J9=\"\",\"\",+GORLIS!J9)","v":""},null,null,{"$f":"IF(GORLIS!M9=\"\",\"\",+GORLIS!M9)","v":""},null,{"$f":"IF(GORLIS!O9=\"\",\"\",+GORLIS!O9)","v":""},{"$f":"IF(GORLIS!P9=\"\",\"\",+GORLIS!P9)","v":""},{"$f":"IF(GORLIS!Q9=\"\",\"\",+GORLIS!Q9)","v":""},{"$f":"IF(GORLIS!R9=\"\",\"\",+GORLIS!R9)","v":""},{"$f":"IF(J8=\"\",\"\",CONCATENATE(GORLIS!T9,\"--\",J8))","v":""},null,null,0,null,0,null,{"$f":"IF(GORLIS!S9=\"\",\"\",+GORLIS!S9)","v":""}]
[null,{"$f":"IF(GORLIS!B10=\"\",\"\",B8+1)","v":""},{"$f":"IF(GORLIS!B10=\"\",\"\",+GORLIS!B10)","v":""},{"$f":"IF(GORLIS!C10=\"\",\"\",+GORLIS!C10)","v":""},{"$f":"IF(GORLIS!D10=\"\",\"\",+GORLIS!D10)","v":""},{"$f":"IF(GORLIS!E10=\"\",\"\",+GORLIS!E10)","v":""},{"$f":"IF(GORLIS!F10=\"\",\"\",+GORLIS!F10)","v":""},{"$f":"IF(GORLIS!G10=\"\",\"\",+GORLIS!G10)","v":""},{"$f":"IF(GORLIS!H10=\"\",\"\",+GORLIS!H10)","v":""},{"$f":"IF(GORLIS!I10=\"\",\"\",+GORLIS!I10)","v":""},{"$f":"IF(GORLIS!J10=\"\",\"\",+GORLIS!J10)","v":""},null,null,{"$f":"IF(GORLIS!M10=\"\",\"\",+GORLIS!M10)","v":""},null,{"$f":"IF(GORLIS!O10=\"\",\"\",+GORLIS!O10)","v":""},{"$f":"IF(GORLIS!P10=\"\",\"\",+GORLIS!P10)","v":""},{"$f":"IF(GORLIS!Q10=\"\",\"\",+GORLIS!Q10)","v":""},{"$f":"IF(GORLIS!R10=\"\",\"\",+GORLIS!R10)","v":""},{"$f":"IF(J9=\"\",\"\",CONCATENATE(GORLIS!T10,\"--\",J9))","v":""},null,null,0,null,0,null,{"$f":"IF(GORLIS!S10=\"\",\"\",+GORLIS!S10)","v":""}]
[null,{"$f":"IF(GORLIS!B11=\"\",\"\",B9+1)","v":""},{"$f":"IF(GORLIS!B11=\"\",\"\",+GORLIS!B11)","v":""},{"$f":"IF(GORLIS!C11=\"\",\"\",+GORLIS!C11)","v":""},{"$f":"IF(GORLIS!D11=\"\",\"\",+GORLIS!D11)","v":""},{"$f":"IF(GORLIS!E11=\"\",\"\",+GORLIS!E11)","v":""},{"$f":"IF(GORLIS!F11=\"\",\"\",+GORLIS!F11)","v":""},{"$f":"IF(GORLIS!G11=\"\",\"\",+GORLIS!G11)","v":""},{"$f":"IF(GORLIS!H11=\"\",\"\",+GORLIS!H11)","v":""},{"$f":"IF(GORLIS!I11=\"\",\"\",+GORLIS!I11)","v":""},{"$f":"IF(GORLIS!J11=\"\",\"\",+GORLIS!J11)","v":""},null,null,{"$f":"IF(GORLIS!M11=\"\",\"\",+GORLIS!M11)","v":""},null,{"$f":"IF(GORLIS!O11=\"\",\"\",+GORLIS!O11)","v":""},{"$f":"IF(GORLIS!P11=\"\",\"\",+GORLIS!P11)","v":""},{"$f":"IF(GORLIS!Q11=\"\",\"\",+GORLIS!Q11)","v":""},{"$f":"IF(GORLIS!R11=\"\",\"\",+GORLIS!R11)","v":""},{"$f":"IF(J10=\"\",\"\",CONCATENATE(GORLIS!T11,\"--\",J10))","v":""},null,null,0,null,0,null,{"$f":"IF(GORLIS!S11=\"\",\"\",+GORLIS!S11)","v":""}]
{"$rows_left_out":139}
{"sheet":"Yolluk Bildirimi","index":4,"n_rows":47,"n_cols":25,"rows_kept":47,"cut":false,"hidden":false,"merged":[[11,21,11,22],[10,10,10,15],[13,14,14,15],[14,21,14,22],[15,20,16,20],[13,11,13,13],[18,1,38,1],[40,21,40,22],[40,16,40,17],[12,3,17,3],[14,12,17,12],[13,10,17,10],[13,8,17,9],[44,8,45,10],[40,8,40,11],[40,12,40,13],[14,11,17,11],[13,16,14,17],[13,18,14,19]]}
[]
[]
[]
[]
[]
[]
[]
[]
[]
[null,null,null,null,null,null," ",null,"ADI SOYADI",{"$f":"IF(ISERROR(VLOOKUP($D$19,'Bildirim İçin'!$B$3:$R$90,3,FALSE)),0,(VLOOKUP($D$19,'Bildirim İçin'!$B$3:$R$90,3,FALSE)))","v":"dkdkdk"}]
{"$rows_left_out":38}
{"sheet":"YEVİMEYELER","index":5,"n_rows":41,"n_cols":12,"rows_kept":41,"cut":false,"hidden":false,"merged":[[13,1,13,2],[8,1,8,3],[9,3,10,3],[3,1,5,2],[9,1,10,2],[11,1,11,2],[12,1,12,2]]}
[]
[]
[]
[null,"HARCİRAH",null,"2015-01-01"]
[null,null,null,"2015-12-31"]
[null,null,null,"2015 yılı Bütçe Kanunun H Cetveli",null,null,null,"Derece","Yevmiye",null,"Ek Gösterge","Yevmiye"]
[null,"5   - 15 DERECE",null,32,null,null,null,1,{"$f":"+$D$8","v":33},null,3000,{"$f":"+$D$12","v":37.5}]
[null,"1   -   4 DERECE",null,33,null,null,null,2,{"$f":"+$D$8","v":33},null,3100,{"$f":"+$D$12","v":37.5}]
[null,null,null,null,null,null,null,3,{"$f":"+$D$8","v":33},null,3200,37.5]
[null,"EK GÖSTERGESİ",null,null,null,null,null,4,{"$f":"+$D$8","v":33},null,3300,37.5]
{"$rows_left_out":32}
{"sheet":"Sayfa1","index":6,"n_rows":4,"n_cols":20,"rows_kept":4,"cut":false,"hidden":false,"merged":[]}
[]
[]
[null,null,{"$f":"+'GÖREVLENDİRME ONAYI'!C12","v":"Adı Soyadı"},{"$f":"+'GÖREVLENDİRME ONAYI'!E12","v":"Görevi"},{"$f":"+'GÖREVLENDİRME ONAYI'!G11","v":"Kadro  Der"},{"$f":"+'GÖREVLENDİRME ONAYI'!H11","v":"Yevmiye Tutarı"},{"$f":"+'GÖREVLENDİRME ONAYI'!I11","v":"Harcirah Ödeneği Bütçe Tertibi"},{"$f":"+'GÖREVLENDİRME ONAYI'!C16","v":"Gittiği Yerdeki Görevin Mahiyeti"},{"$f":"+'GÖREVLENDİRME ONAYI'!C21","v":"Geçici görevle görevlendirildiği şehir."},"Gidiş Tarihi","                    Dönüş Tarihi","Geçen Süre (Gün)",{"$f":"+'GÖREVLENDİRME ONAYI'!I24","v":"Gidiş Saati"},{"$f":"+'GÖREVLENDİRME ONAYI'!I26","v":"Dönüş Saati"},{"$f":"+'GÖREVLENDİRME ONAYI'!C28","v":"Bindiği vasıtanın cinsi"},{"$f":"+'GÖREVLENDİRME ONAYI'!E28","v":" Resmi vasıta ise  plaka nosu"},{"$f":"+'GÖREVLENDİRME ONAYI'!G28","v":"Şöförün adı ve soyadı"},"Otobüs Ücreti","Ek Gösterge","İlk Hareket"]
[null,{"$f":"+'GÖREVLENDİRME ONAYI'!I7","v":"00:00:00"},{"$f":"+'GÖREVLENDİRME ONAYI'!C13","v":"dkdkdk"},{"$f":"+'GÖREVLENDİRME ONAYI'!E13","v":"dsjasoj"},{"$f":"+'GÖREVLENDİRME ONAYI'!G13","v":""},{"$f":"+'GÖREVLENDİRME ONAYI'!H13","v":0},{"$f":"+'GÖREVLENDİRME ONAYI'!I13","v":0},{"$f":"+'GÖREVLENDİRME ONAYI'!E16","v":0},{"$f":"+'GÖREVLENDİRME ONAYI'!E21","v":0},{"$f":"+'GÖREVLENDİRME ONAYI'!G25","v":"00:00:00"},{"$f":"+'GÖREVLENDİRME ONAYI'!G27","v":"00:00:00"},null,{"$f":"+'GÖREVLENDİRME ONAYI'!J24","v":"00:00:00"},{"$f":"+'GÖREVLENDİRME ONAYI'!J26","v":"00:00:00"},{"$f":"+'GÖREVLENDİRME ONAYI'!C30","v":0},{"$f":"+'GÖREVLENDİRME ONAYI'!E30","v":0},{"$f":"+'GÖREVLENDİRME ONAYI'!G30","v":0},{"$f":"+'GÖREVLENDİRME ONAYI'!N25","v":0},{"$f":"+'GÖREVLENDİRME ONAYI'!G15","v":""},{"$f":"+'BİLGİ GİRİŞİ'!G14","v":0}]

{"sheet":"Saatler","index":7,"n_rows":25,"n_cols":13,"rows_kept":25,"cut":false,"hidden":false,"merged":[[3,0,11,0],[13,0,19,0],[23,1,23,12],[24,1,24,12],[2,1,2,3],[2,7,2,9],[21,1,21,12],[22,1,22,12]]}
[]
[]
[null,"Çıkış Saati Aşağıdaki Zaman Dilimi İçersinde",null,null,null,null,null,"Dönüş Saati Aşağıdaki Zaman Dilimi İçersinde",null,null,null,null,"Yevmiye"]
["Gece 00:01 ile Gündüz 12:59 Arası Çıkışlar","00:01:00","ile","12:59:00","Arası",null,null,"00:02:00","ile","12:59:00","Arası",null,0]
[]
[null,"00:01:00","ile","12:59:00","Arası",null,null,"13:01:00","ile","18:59:00","Arası",null,0.33333333333333331]
[]
[null,"00:01:00","ile","12:59:00","Arası",null,null,"13:01:00","ile","19:01:00","Arası",null,0.66666666666666663]
[]
[null,"00:01:00","ile","12:59:00","Arası",null,null,"00:01:00","ile","12:59:00","Arası","24 Saati Doldurmuşsa",1]
{"$rows_left_out":16}
{"sheet":"GORLIS","index":8,"n_rows":5,"n_cols":20,"rows_kept":5,"cut":false,"hidden":false,"merged":[]}
[]
[]
[null,"Evrak Tarihi",{"$f":"+'GÖREVLENDİRME ONAYI'!C12","v":"Adı Soyadı"},{"$f":"+'GÖREVLENDİRME ONAYI'!E12","v":"Görevi"},{"$f":"+'GÖREVLENDİRME ONAYI'!G11","v":"Kadro  Der"},{"$f":"+'GÖREVLENDİRME ONAYI'!H11","v":"Yevmiye Tutarı"},{"$f":"+'GÖREVLENDİRME ONAYI'!I11","v":"Harcirah Ödeneği Bütçe Tertibi"},{"$f":"+'GÖREVLENDİRME ONAYI'!C16","v":"Gittiği Yerdeki Görevin Mahiyeti"},{"$f":"+'GÖREVLENDİRME ONAYI'!C21","v":"Geçici görevle görevlendirildiği şehir."},"Gidiş Tarihi","                    Dönüş Tarihi","Geçen Süre (Gün)",{"$f":"+'GÖREVLENDİRME ONAYI'!I24","v":"Gidiş Saati"},{"$f":"+'GÖREVLENDİRME ONAYI'!I26","v":"Dönüş Saati"},{"$f":"+'GÖREVLENDİRME ONAYI'!C28","v":"Bindiği vasıtanın cinsi"},{"$f":"+'GÖREVLENDİRME ONAYI'!E28","v":" Resmi vasıta ise  plaka nosu"},{"$f":"+'GÖREVLENDİRME ONAYI'!G28","v":"Şöförün adı ve soyadı"},{"$f":"+'GÖREVLENDİRME ONAYI'!N24","v":"Otobüs Ücreti"},"Ek Göst","İlk Hareket"]
[null,"00:00:00","dkdkdk","dsjasoj","",0,0,0,0,"00:00:00","00:00:00",null,"00:00:00","00:00:00",0,0,0,0,"",0]
[null,"00:00:00","dkdkdk","dsjasoj","",0,0,0,0,"00:00:00","00:00:00",null,"00:00:00","00:00:00",0,0,0,0,"",0]