{"text_format":"1","workbook":"xlsx","n_sheets":9,"sheets":["Saatler (2)","BİLGİ GİRİŞİ","GÖREVLENDİRME ONAYI","Bildirim İçin","Yolluk Bildirimi","YEVİMEYELER","Sayfa1","Saatler","GORLIS"],"not_rendered":{"charts":0,"images":0,"macros":1,"external_links":0,"defined_names":4,"comments":6,"pivot_tables":0},"unopened":[],"bounds":{"document_bytes":16777216,"sheet_cells":100000,"rows_first":2000,"rows_last":500,"rows_between":2000,"halvings":0,"cell_chars":16384,"cell_head_chars":4096},"cells_cut":0,"cells_raw":0,"read":"whole","date_system":"1900"}

{"sheet":"Saatler (2)","index":0,"n_rows":36,"n_cols":13,"rows_kept":36,"cut":false,"hidden":false,"merged":[[30,1,30,12],[33,1,33,12],[23,0,23,12],[24,0,35,0],[32,1,32,12],[35,1,35,12],[31,1,31,12],[34,1,34,12],[29,1,29,12],[25,1,25,12],[28,1,28,12],[3,6,8,6],[27,1,27,12],[2,0,2,4],[2,6,2,10],[3,0,8,0],[24,1,24,12],[10,0,22,0],[10,6,22,6],[26,1,26,12]]}
[]
[]
["Çıkış Saati Aşağıdaki Zaman Dilimi İçersinde",null,null,null,null,null,"Dönüş Saati Aşağıdaki Zaman Dilimi İçersinde İse",null,null,null,null,null,"Yevmiye"]
[null,"00:01:00","ile","12:59:00","Arası",null,null,"00:02:00","ile","12:59:00","Arası",null,0]
[]
[null,"00:01:00","ile","12:59:00","Arası",null,null,"13:01:00","ile","18:59:00","Arası",null,0.33333333333333331]
[]
[null,"00:01:00","ile","12:59:00","Arası",null,null,"19:01:00","ile","19:59:00","Arası",null,0.66666666666666663]
[]
[]
[null,"13:01:00","ile","18:59:00","Arası",null,null,"13:02:00","ile","18:59:00","Arası",null,0]
[]
[null,"13:01:00","ile","18:59:00","Arası",null,null,"19:01:00","ile","19:59:00","Arası",null,0.33333333333333331]
[]
[null,"13:01:00","ile","18:59:00","Arası",null,null,"20:01:00","ile","06:01:00","Arası",null,0.66666666666666663]
[]
[null,"18:59:00","ile","19:59:00","Arası",null,null,"19:01:00","ile","19:59:00","Arası",null,0.33333333333333331]
[]
[null,"18:59:00","ile","19:59:00","Arası",null,null,"19:01:00","ile","20:01:00","Arası",null,0.66666666666666663]
[]
[null,"18:59:00","ile","19:59:00","Arası",null,null,"19:01:00","ile","06:01:00","Arası",null,0.66666666666666663]
[]
[null,"20:01:00","ile","05:59:00","Arası",null,null,"20:01:00","ile","06:01:00","Arası",null,0.33333333333333331]
[]
[null,"657 Sayılı Devlet Memurları Kanunu"]
[null,"Yolluk giderleri ve gündelikleri:\n             Madde 177 – Bu Kanun hükümlerine tabi Devlet memurlarından bir görevin ifası için sürekli veya geçici olarak görev yerinden ayrılanların yol giderleri ve gündelikleri, yolluklar hakkındaki özel kanun hükümlerine göre ödenir.\n             Sözleşmeli olarak çalıştırılanların yol masrafları ile gündelikleri sözleşmelerindeki şartlara göre ödenir.\n"]
[null,"6245 HARCIRAH KANUNU"]
[null,"Memuriyet mahalli dışına gönderilenlerin gündeliği:\n Madde 39 – (Değişik: 11/12/1981 - 2562/16 md.)\n             Resmi bir görevle memuriyet mahalli içinde bir yere gönderilenlere gündelik verilmez. Geçici bir görevle memuriyet mahalli dışındaki bir yere gönderilenlerden, buralarda ve yolda öğle (saat 13.00) ve akşam (saat 19.00) yemeği zamanlarından birini geçirenlere 1/3, ikisini geçirenlere 2/3 oranında ve geceyi de geçirenlere tam gündelik verilir."]
[null,"1475 Sayılı İŞ KANUNU"]
[null,"GECE SÜRESİ: \n\nMADDE 65 — I — İş hayatında (Gece) en geç saat 20'de başlayarak en erken sabah 6'ya kadar geçen ve her halde en fazla 11 saat süren gün dönemidir. \n"]
[]
[null,"6245 HARCIRAH KANUNU"]
[null,"Madde 42 – (Değişik: 11/12/1981 - 2562/17 md.)\n             Geçici bir görev ile başka bir yere gönderilenlere, görev mahalline varış tarihinden itibaren bu Kanuna göre verilen gündelikler:\n             a. Yurtiçinde bir yıllık dönem zarfında aynı yerde, aynı iş için ve aynı şahsa 180 günden fazla verilemez. İlk 90 gün için tam, takibeden 90 gün için 2/3 oranında ödenir.\n           ....\n             Geçici görevlendirmelerde meydana gelecek ara vermeler bu müddetleri veya gündelik miktarını artırmaya neden olamaz."]
[]
[null,"6245 HARCIRAH KANUNU"]
[null,"Harcırahın sureti tediyesi:\n             Madde 57 – Harcırah hizmetin taallük ettiği kurum bütçesinden ödenir. "]

{"sheet":"BİLGİ GİRİŞİ","index":1,"n_rows":37,"n_cols":16,"rows_kept":37,"cut":false,"hidden":false,"merged":[[24,3,24,4],[2,3,2,4],[8,0,8,1],[0,15,4,15],[12,15,14,15],[16,15,18,15],[5,15,7,15],[8,15,11,15],[20,3,20,4]]}
[null,null,null,null,null,null,null,null,null,null,null,null,null,null,null,"Not:1-Herhangibir nedenle yapılacak olan görevlendirmelerde,  göreve gitmeden önce bu sayfa üzerinden bilgi girişi yapılarak \"GÖREVLENDİRME ONAYI\"  hazırlanır."]
[]
[null,null,null,"Görevlendirme Formu Giriş Ekranı"]
[]
[null,null,null,"Evrak Tarihi"]
[null,null,null,{"$f":"+'GÖREVLENDİRME ONAYI'!C12","v":"Adı Soyadı"},"dkdkdk",null,null,null,null,null,null,null,null,null,null,"2-   Görev Dönüşünde,Çıktısı Alınan Görevlendirme Onayı Üzerine Dönüşe Ait Bilgiler KALEMLE Yazılacaktır."]
[null,null,null,{"$f":"+'GÖREVLENDİRME ONAYI'!E12","v":"Görevi"},"dsjasoj"]
[null,null,null,{"$f":"+'GÖREVLENDİRME ONAYI'!G11","v":"Kadro  Der"}]
[{"$f":"NOW()","v":"2021-11-16T17:28:15.530"},null,null,"Ek Göstergeniz",null,null,null,null,null,null,null,null,null,null,null,"3- Bilgi Girişi sayfasında bulunan kayıt butunu,  yazılan bilgileri \"BİLDİRİM İÇİN\"  sayfasına kaydeder. Kaydedilen bilgiler Görev dönüşünde Geçici Görev Yoluğu Bildirimi düzenlenmesi için kullanılır."]
[{"$f":"IF(E9>=3000,0,IF(ISERROR(VLOOKUP(E8,YEVİMEYELER!H7:I21,2,FALSE)),0,VLOOKUP(E8,YEVİMEYELER!H7:I21,2,FALSE)))","v":0},{"$f":"IF(E9<=0,0,IF(ISERROR(VLOOKUP(E9,YEVİMEYELER!K7:L41,2,FALSE)),0,VLOOKUP(E9,YEVİMEYELER!K7:L41,2,FALSE)))","v":0},null,{"$f":"+'GÖREVLENDİRME ONAYI'!H11","v":"Yevmiye Tutarı"},{"$f":"IF(B10<=0,+A10,+B10)","v":0}]
[null,null,null,{"$f":"+'GÖREVLENDİRME ONAYI'!I11","v":"Harcirah Ödeneği Bütçe Tertibi"}]
[null,null,null,"Harcirah Ödenecek Birim"]
[null,null,null,{"$f":"+'GÖREVLENDİRME ONAYI'!C16","v":"Gittiği Yerdeki Görevin Mahiyeti"},null,null,null,null,null,null,null,null,null,null,null,"3- Görev Dönüşünde ise \"BİLDİRiM İÇİN\" sayfasında bulunan \"SARI\" renkli alanlara, \"Dönüş Tarihi,Saati,Otel Ücreti vb.\" bilgiler Girilir."]
[null,null,null,{"$f":"+'GÖREVLENDİRME ONAYI'!C21","v":"Geçici görevle görevlendirildiği şehir."},null,"İlk Hareket Ettiği Şehir"]
[null,null,null,{"$f":"+'GÖREVLENDİRME ONAYI'!G24","v":"Gidiş Tarihi"},null,{"$f":"+'GÖREVLENDİRME ONAYI'!I24","v":"Gidiş Saati"}]
[]
[null,null,null,{"$f":"+'GÖREVLENDİRME ONAYI'!C28","v":"Bindiği vasıtanın cinsi"},null,null,null,null,null,null,null,null,null,null,null,"4- Son Halini Alan Görevlendirmeler \"YOLLUK BİLDİRİMİ\" bölümünden, bildirim için sayfasında bulunan bilgilere göre (sıra numarası seçilerek) döküm alınır."]
[null,null,null,{"$f":"+'GÖREVLENDİRME ONAYI'!E28","v":" Resmi vasıta ise  plaka nosu"}]
[null,null,null,{"$f":"+'GÖREVLENDİRME ONAYI'!G28","v":"Şöförün adı ve soyadı"},null,"Otobüs Ücreti TL"]
[]
[null,null,null,"1.İmza"]
[null,null,null,"Adı Soyadı"]
[null,null,null,"Ünvanı"]
[]
[null,null,null,"2.İmza"]
[null,null,null,"Adı Soyadı"]
[null,null,null,"Ünvanı"]
[]
[]
[]
[]
[]
[]
[]
[]
[null,null,null,null,null,null,null,null,null,null,null,null,null,null,null,"Mustafa İŞBİLİR                                A.K.Ü İdari ve Mali İşl.Dai.Bşk.                       Tahakkuk Şube Müdürü"]
[null,null,null,null,null,null,null,null,null,null,null,null,null,null,null,"V.Mİ.13032012 1150"]

{"sheet":"GÖREVLENDİRME ONAYI","index":2,"n_rows":52,"n_cols":18,"rows_kept":52,"cut":false,"hidden":false,"merged":[[23,2,26,3],[15,4,19,10],[12,8,14,10],[15,2,19,3],[12,7,14,7],[12,2,14,3],[12,4,14,5],[25,9,26,9],[24,6,24,7],[26,6,26,7],[6,3,6,5],[12,6,13,6],[20,2,22,3],[20,4,22,10],[1,4,1,8],[10,7,11,7],[6,8,6,9],[8,3,8,8],[11,2,11,3],[11,4,11,5],[2,3,2,9],[3,3,3,9],[10,6,11,6],[10,8,11,10],[48,4,48,7],[45,4,45,7],[25,8,26,8],[23,6,23,7],[32,2,35,10],[29,6,30,7],[29,2,30,3],[27,2,28,3],[46,4,47,8],[38,8,38,10],[29,8,30,10],[44,4,44,7],[40,4,40,7],[41,4,41,7],[29,4,30,5],[37,8,37,10],[27,4,28,5],[27,6,28,7],[27,8,28,10],[23,4,26,4],[23,9,24,9],[23,5,26,5],[25,6,25,7],[23,8,24,8]]}
[]
[null,null,null,null,"T.C."]
[null,null,null,"AFYON KOCATEPE ÜNİVERSİTESİ REKTÖRLÜĞÜ",null,null,null,null,null,null,null,null,null,null,null," "]
[null,null,null,{"$f":"+'BİLGİ GİRİŞİ'!E12","v":0},null,null,null,null,null,null,null,null,null," "]
[]
[null,null,"SAYI      :",null," /"]
[null,null,"KONU    :","GÖREVLENDİRME",null,null,null,null,{"$f":"+'BİLGİ GİRİŞİ'!E5","v":"00:00:00"},null,null,null,null,null,null," "]
[]
[null,null,null,"Geçici Görevle Görevlendirilen Üniversitemiz Görevlisi"]
[]
[null,null,null,null,null,null,"Kadro  Der","Yevmiye Tutarı","Harcirah Ödeneği Bütçe Tertibi"]
[null,null,"Adı Soyadı",null,"Görevi"]
[null,null,{"$f":"+'BİLGİ GİRİŞİ'!E6","v":"dkdkdk"},null,{"$f":"+'BİLGİ GİRİŞİ'!E7","v":"dsjasoj"},null,{"$f":"IF('BİLGİ GİRİŞİ'!E8=\"\",\"\",+'BİLGİ GİRİŞİ'!E8)","v":""},{"$f":"+'BİLGİ GİRİŞİ'!E10","v":0},{"$f":"+'BİLGİ GİRİŞİ'!E11","v":0}]
[null,null,null,null,null,null,null,null,null,null,null,null," ",null,null,null,null," "]
[null,null,null,null,null,null,{"$f":"IF('BİLGİ GİRİŞİ'!E9=\"\",\"\",+'BİLGİ GİRİŞİ'!E9)","v":""},null,null,null,null,null,null,null,null,null,null," "]
[null,null,"Gittiği Yerdeki Görevin Mahiyeti",null,{"$f":"+'BİLGİ GİRİŞİ'!E13","v":0}]
[null,null,null,null,null,null,null,null,null,null,null," "]
[null,null,null,null,null,null,null,null,null,null,null," "]
[]
[]
[null,null,"Geçici görevle görevlendirildiği şehir.",null,{"$f":"+'BİLGİ GİRİŞİ'!E14","v":0}]
[]
[]
[null,null,"Görev süresi (Gidiş-Dönüş tarih ve saati)",null,null,"Gün","Gidiş Tarihi",null,"Gidiş Saati",{"$f":"+'BİLGİ GİRİŞİ'!G15","v":"00:00:00"},null,null,null,"Otobüs Ücreti"]
[null,null,null,null,null,null,{"$f":"+'BİLGİ GİRİŞİ'!E15","v":"00:00:00"},null,null,null,null,null," ",{"$f":"+'BİLGİ GİRİŞİ'!G19","v":0}," ",null," "]
[null,null,null,null,null,null,"Dönüş Tarihi",null,"Dönüş Saati",{"$f":"+'BİLGİ GİRİŞİ'!G16","v":"00:00:00"},null,null,null,null,null,null," "]
[null,null,null,null,null,null,{"$f":"+'BİLGİ GİRİŞİ'!E16","v":"00:00:00"}]
[null,null,"Bindiği vasıtanın cinsi",null," Resmi vasıta ise  plaka nosu",null,"Şöförün adı ve soyadı",null," "]
[]
[null,null,{"$f":"+'BİLGİ GİRİŞİ'!E17","v":0},null,{"$f":"+'BİLGİ GİRİŞİ'!E18","v":0},null,{"$f":"+'BİLGİ GİRİŞİ'!E19","v":0}]
[]
[null,null,null,null,null,null," "]
[null,null,"                 Yukarıda adı ve soyadı ile durumları açıklanan   Üniversitemiz  görevlilerinin hizalarında gösterilen mahallerde geçici görevle görevlendirilmelerine ve seyahat maksadı ile yolluklu izinli sayılmalarını, müsaadelerinize arz ederim.            "]
[]
[]
[]
[]
[null,null,null,null,null,null,null,null,{"$f":"+'BİLGİ GİRİŞİ'!E22","v":0}]
[null,null,null,null,null,null,null,null,{"$f":"+'BİLGİ GİRİŞİ'!E23","v":0},null,null,null,null," "," ",null," "]
[null,null,null,null,null," "," ",null,null,null,null,null,null,null," ",null," "]
[null,null,null,null,"O   L   U   R",null,null,null,null,null,null,null," ",null," "]
[null,null,null,null,{"$f":"+I7","v":"00:00:00"}]
[]
[]
[null,null,null,null,{"$f":"+'BİLGİ GİRİŞİ'!E26","v":0}]
[null,null,null,null,{"$f":"+'BİLGİ GİRİŞİ'!E27","v":0}]
[null,null,null,null," "]
[]
[null,null,null,null," "]
[null,null,null,null," "," ",null,null,null,null,null,null,null,null,null,null,null," "]
[null,null,null,null,null," ",null,null,null,null,null,null," ",null,null,null," "," "]
[null,null,null,null,null," "," "]

{"sheet":"Bildirim İçin","index":3,"n_rows":148,"n_cols":27,"rows_kept":148,"cut":false,"hidden":false,"merged":[]}
[]
[null,"Sıra No","Evrak Tarihi","Adı Soyadı","Görevi","Kadro / Derece","Yevmiye Tutarı","Harcirah Ödeneği Bütçe Tertibi","Gittiği Yerdeki Görevin Mahiyeti","Geçici görevle görevlendirildiği şehir.","Gidiş Tarihi","                    Dönüş Tarihi","Harcirah için Geçen Süre (Gün)","Gidiş Saati","Dönüş Saati","Bindiği vasıtanın cinsi"," Resmi vasıta ise  plaka nosu","Şöförün adı ve soyadı","Otobüs Ücreti","Yer","Otel Giriş Tarihi","Otel Çıkış Tarihi","Ödenecek Süre","Otel Fatura Tutarı","Ödenebilecek Azami Tutar TL","Taksi Ücreti","Ek Göst."]
[null,{"$f":"IF(GORLIS!B4=\"\",\"\",1)","v":1},{"$f":"IF(GORLIS!B4=\"\",\"\",+GORLIS!B4)","v":"00:00:00"},{"$f":"IF(GORLIS!C4=\"\",\"\",+GORLIS!C4)","v":"dkdkdk"},{"$f":"IF(GORLIS!D4=\"\",\"\",+GORLIS!D4)","v":"dsjasoj"},{"$f":"IF(GORLIS!E4=\"\",\"\",+GORLIS!E4)","v":""},{"$f":"IF(GORLIS!F4=\"\",\"\",+GORLIS!F4)","v":0},{"$f":"IF(GORLIS!G4=\"\",\"\",+GORLIS!G4)","v":"00:00:00"},{"$f":"IF(GORLIS!H4=\"\",\"\",+GORLIS!H4)","v":0},{"$f":"IF(GORLIS!I4=\"\",\"\",+GORLIS!I4)","v":0},{"$f":"IF(GORLIS!J4=\"\",\"\",+GORLIS!J4)","v":"00:00:00"},null,null,{"$f":"IF(GORLIS!M4=\"\",\"\",+GORLIS!M4)","v":"00:00:00"},null,{"$f":"IF(GORLIS!O4=\"\",\"\",+GORLIS!O4)","v":0},{"$f":"IF(GORLIS!P4=\"\",\"\",+GORLIS!P4)","v":0},{"$f":"IF(GORLIS!Q4=\"\",\"\",+GORLIS!Q4)","v":0},{"$f":"IF(GORLIS!R4=\"\",\"\",+GORLIS!R4)","v":0},{"$f":"IF(J3=\"\",\"\",CONCATENATE(GORLIS!T4,\"--\",J3))","v":"0--0"},null,null,{"$f":"IF(V3-U3>M3,+M3,IF((V3-U3)>10,10,(V3-U3)))","v":0},null,{"$f":"IF(G3=\"\",0,IF(W3<=0,0,IF(W3*((G3*0.5)+G3)>=X3,+X3,W3*((G3*0.5)+G3))))","v":0},null,{"$f":"IF(GORLIS!S4=\"\",\"\",+GORLIS!S4)","v":""}]
[null,{"$f":"IF(GORLIS!B5=\"\",\"\",B3+1)","v":2},{"$f":"IF(GORLIS!B5=\"\",\"\",+GORLIS!B5)","v":"00:00:00"},{"$f":"IF(GORLIS!C5=\"\",\"\",+GORLIS!C5)","v":"dkdkdk"},{"$f":"IF(GORLIS!D5=\"\",\"\",+GORLIS!D5)","v":"dsjasoj"},{"$f":"IF(GORLIS!E5=\"\",\"\",+GORLIS!E5)","v":""},{"$f":"IF(GORLIS!F5=\"\",\"\",+GORLIS!F5)","v":0},{"$f":"IF(GORLIS!G5=\"\",\"\",+GORLIS!G5)","v":"00:00:00"},{"$f":"IF(GORLIS!H5=\"\",\"\",+GORLIS!H5)","v":0},{"$f":"IF(GORLIS!I5=\"\",\"\",+GORLIS!I5)","v":0},{"$f":"IF(GORLIS!J5=\"\",\"\",+GORLIS!J5)","v":"00:00:00"},null,null,{"$f":"IF(GORLIS!M5=\"\",\"\",+GORLIS!M5)","v":"00:00:00"},null,{"$f":"IF(GORLIS!O5=\"\",\"\",+GORLIS!O5)","v":0},{"$f":"IF(GORLIS!P5=\"\",\"\",+GORLIS!P5)","v":0},{"$f":"IF(GORLIS!Q5=\"\",\"\",+GORLIS!Q5)","v":0},{"$f":"IF(GORLIS!R5=\"\",\"\",+GORLIS!R5)","v":0},{"$f":"IF(J4=\"\",\"\",CONCATENATE(GORLIS!T5,\"--\",J4))","v":"0--0"},null,null,{"$f":"IF(V4-U4>M4,+M4,IF((V4-U4)>10,10,(V4-U4)))","v":0},null,{"$f":"IF(G4=\"\",0,IF(W4<=0,0,IF(W4*((G4*0.5)+G4)>=X4,+X4,W4*((G4*0.5)+G4))))","v":0},null,{"$f":"IF(GORLIS!S5=\"\",\"\",+GORLIS!S5)","v":""}]
[null,{"$f":"IF(GORLIS!B6=\"\",\"\",B4+1)","v":""},{"$f":"IF(GORLIS!B6=\"\",\"\",+GORLIS!B6)","v":""},{"$f":"IF(GORLIS!C6=\"\",\"\",+GORLIS!C6)","v":""},{"$f":"IF(GORLIS!D6=\"\",\"\",+GORLIS!D6)","v":""},{"$f":"IF(GORLIS!E6=\"\",\"\",+GORLIS!E6)","v":""},{"$f":"IF(GORLIS!F6=\"\",\"\",+GORLIS!F6)","v":""},{"$f":"IF(GORLIS!G6=\"\",\"\",+GORLIS!G6)","v":""},{"$f":"IF(GORLIS!H6=\"\",\"\",+GORLIS!H6)","v":""},{"$f":"IF(GORLIS!I6=\"\",\"\",+GORLIS!I6)","v":""},{"$f":"IF(GORLIS!J6=\"\",\"\",+GORLIS!J6)","v":""},null,null,{"$f":"IF(GORLIS!M6=\"\",\"\",+GORLIS!M6)","v":""},null,{"$f":"IF(GORLIS!O6=\"\",\"\",+GORLIS!O6)","v":""},{"$f":"IF(GORLIS!P6=\"\",\"\",+GORLIS!P6)","v":""},{"$f":"IF(GORLIS!Q6=\"\",\"\",+GORLIS!Q6)","v":""},{"$f":"IF(GORLIS!R6=\"\",\"\",+GORLIS!R6)","v":""},{"$f":"IF(J5=\"\",\"\",CONCATENATE(GORLIS!T6,\"--\",J5))","v":""},null,null,0,null,0,null,{"$f":"IF(GORLIS!S6=\"\",\"\",+GORLIS!S6)","v":""}]
[null,{"$f":"IF(GORLIS!B7=\"\",\"\",B5+1)","v":""},{"$f":"IF(GORLIS!B7=\"\",\"\",+GORLIS!B7)","v":""},{"$f":"IF(GORLIS!C7=\"\",\"\",+GORLIS!C7)","v":""},{"$f":"IF(GORLIS!D7=\"\",\"\",+GORLIS!D7)","v":""},{"$f":"IF(GORLIS!E7=\"\",\"\",+GORLIS!E7)","v":""},{"$f":"IF(GORLIS!F7=\"\",\"\",+GORLIS!F7)","v":""},{"$f":"IF(GORLIS!G7=\"\",\"\",+GORLIS!G7)","v":""},{"$f":"IF(GORLIS!H7=\"\",\"\",+GORLIS!H7)","v":""},{"$f":"IF(GORLIS!I7=\"\",\"\",+GORLIS!I7)","v":""},{"$f":"IF(GORLIS!J7=\"\",\"\",+GORLIS!J7)","v":""},null,null,{"$f":"IF(GORLIS!M7=\"\",\"\",+GORLIS!M7)","v":""},null,{"$f":"IF(GORLIS!O7=\"\",\"\",+GORLIS!O7)","v":""},{"$f":"IF(GORLIS!P7=\"\",\"\",+GORLIS!P7)","v":""},{"$f":"IF(GORLIS!Q7=\"\",\"\",+GORLIS!Q7)","v":""},{"$f":"IF(GORLIS!R7=\"\",\"\",+GORLIS!R7)","v":""},{"$f":"IF(J6=\"\",\"\",CONCATENATE(GORLIS!T7,\"--\",J6))","v":""},null,null,0,null,0,null,{"$f":"IF(GORLIS!S7=\"\",\"\",+GORLIS!S7)","v":""}]
[null,{"$f":"IF(GORLIS!B8=\"\",\"\",B6+1)","v":""},{"$f":"IF(GORLIS!B8=\"\",\"\",+GORLIS!B8)","v":""},{"$f":"IF(GORLIS!C8=\"\",\"\",+GORLIS!C8)","v":""},{"$f":"IF(GORLIS!D8=\"\",\"\",+GORLIS!D8)","v":""},{"$f":"IF(GORLIS!E8=\"\",\"\",+GORLIS!E8)","v":""},{"$f":"IF(GORLIS!F8=\"\",\"\",+GORLIS!F8)","v":""},{"$f":"IF(GORLIS!G8=\"\",\"\",+GORLIS!G8)","v":""},{"$f":"IF(GORLIS!H8=\"\",\"\",+GORLIS!H8)","v":""},{"$f":"IF(GORLIS!I8=\"\",\"\",+GORLIS!I8)","v":""},{"$f":"IF(GORLIS!J8=\"\",\"\",+GORLIS!J8)","v":""},null,null,{"$f":"IF(GORLIS!M8=\"\",\"\",+GORLIS!M8)","v":""},null,{"$f":"IF(GORLIS!O8=\"\",\"\",+GORLIS!O8)","v":""},{"$f":"IF(GORLIS!P8=\"\",\"\",+GORLIS!P8)","v":""},{"$f":"IF(GORLIS!Q8=\"\",\"\",+GORLIS!Q8)","v":""},{"$f":"IF(GORLIS!R8=\"\",\"\",+GORLIS!R8)","v":""},{"$f":"IF(J7=\"\",\"\",CONCATENATE(GORLIS!T8,\"--\",J7))","v":""},null,null,0,null,0,null,{"$f":"IF(GORLIS!S8=\"\",\"\",+GORLIS!S8)","v":""}]
[null,{"$f":"IF(GORLIS!B9=\"\",\"\",B7+1)","v":""},{"$f":"IF(GORLIS!B9=\"\",\"\",+GORLIS!B9)","v":""},{"$f":"IF(GORLIS!C9=\"\",\"\",+GORLIS!C9)","v":""},{"$f":"IF(GORLIS!D9=\"\",\"\",+GORLIS!D9)","v":""},{"$f":"IF(GORLIS!E9=\"\",\"\",+GORLIS!E9)","v":""},{"$f":"IF(GORLIS!F9=\"\",\"\",+GORLIS!F9)","v":""},{"$f":"IF(GORLIS!G9=\"\",\"\",+GORLIS!G9)","v":""},{"$f":"IF(GORLIS!H9=\"\",\"\",+GORLIS!H9)","v":""},{"$f":"IF(GORLIS!I9=\"\",\"\",+GORLIS!I9)","v":""},{"$f":"IF(GORLIS!J9=\"\",\"\",+GORLIS!J9)","v":""},null,null,{"$f":"IF(GORLIS!M9=\"\",\"\",+GORLIS!M9)","v":""},null,{"$f":"IF(GORLIS!O9=\"\",\"\",+GORLIS!O9)","v":""},{"$f":"IF(GORLIS!P9=\"\",\"\",+GORLIS!P9)","v":""},{"$f":"IF(GORLIS!Q9=\"\",\"\",+GORLIS!Q9)","v":""},{"$f":"IF(GORLIS!R9=\"\",\"\",+GORLIS!R9)","v":""},{"$f":"IF(J8=\"\",\"\",CONCATENATE(GORLIS!T9,\"--\",J8))","v":""},null,null,0,null,0,null,{"$f":"IF(GORLIS!S9=\"\",\"\",+GORLIS!S9)","v":""}]
[null,{"$f":"IF(GORLIS!B10=\"\",\"\",B8+1)","v":""},{"$f":"IF(GORLIS!B10=\"\",\"\",+GORLIS!B10)","v":""},{"$f":"IF(GORLIS!C10=\"\",\"\",+GORLIS!C10)","v":""},{"$f":"IF(GORLIS!D10=\"\",\"\",+GORLIS!D10)","v":""},{"$f":"IF(GORLIS!E10=\"\",\"\",+GORLIS!E10)","v":""},{"$f":"IF(GORLIS!F10=\"\",\"\",+GORLIS!F10)","v":""},{"$f":"IF(GORLIS!G10=\"\",\"\",+GORLIS!G10)","v":""},{"$f":"IF(GORLIS!H10=\"\",\"\",+GORLIS!H10)","v":""},{"$f":"IF(GORLIS!I10=\"\",\"\",+GORLIS!I10)","v":""},{"$f":"IF(GORLIS!J10=\"\",\"\",+GORLIS!J10)","v":""},null,null,{"$f":"IF(GORLIS!M10=\"\",\"\",+GORLIS!M10)","v":""},null,{"$f":"IF(GORLIS!O10=\"\",\"\",+GORLIS!O10)","v":""},{"$f":"IF(GORLIS!P10=\"\",\"\",+GORLIS!P10)","v":""},{"$f":"IF(GORLIS!Q10=\"\",\"\",+GORLIS!Q10)","v":""},{"$f":"IF(GORLIS!R10=\"\",\"\",+GORLIS!R10)","v":""},{"$f":"IF(J9=\"\",\"\",CONCATENATE(GORLIS!T10,\"--\",J9))","v":""},null,null,0,null,0,null,{"$f":"IF(GORLIS!S10=\"\",\"\",+GORLIS!S10)","v":""}]
[null,{"$f":"IF(GORLIS!B11=\"\",\"\",B9+1)","v":""},{"$f":"IF(GORLIS!B11=\"\",\"\",+GORLIS!B11)","v":""},{"$f":"IF(GORLIS!C11=\"\",\"\",+GORLIS!C11)","v":""},{"$f":"IF(GORLIS!D11=\"\",\"\",+GORLIS!D11)","v":""},{"$f":"IF(GORLIS!E11=\"\",\"\",+GORLIS!E11)","v":""},{"$f":"IF(GORLIS!F11=\"\",\"\",+GORLIS!F11)","v":""},{"$f":"IF(GORLIS!G11=\"\",\"\",+GORLIS!G11)","v":""},{"$f":"IF(GORLIS!H11=\"\",\"\",+GORLIS!H11)","v":""},{"$f":"IF(GORLIS!I11=\"\",\"\",+GORLIS!I11)","v":""},{"$f":"IF(GORLIS!J11=\"\",\"\",+GORLIS!J11)","v":""},null,null,{"$f":"IF(GORLIS!M11=\"\",\"\",+GORLIS!M11)","v":""},null,{"$f":"IF(GORLIS!O11=\"\",\"\",+GORLIS!O11)","v":""},{"$f":"IF(GORLIS!P11=\"\",\"\",+GORLIS!P11)","v":""},{"$f":"IF(GORLIS!Q11=\"\",\"\",+GORLIS!Q11)","v":""},{"$f":"IF(GORLIS!R11=\"\",\"\",+GORLIS!R11)","v":""},{"$f":"IF(J10=\"\",\"\",CONCATENATE(GORLIS!T11,\"--\",J10))","v":""},null,null,0,null,0,null,{"$f":"IF(GORLIS!S11=\"\",\"\",+GORLIS!S11)","v":""}]
[null,{"$f":"IF(GORLIS!B12=\"\",\"\",B10+1)","v":""},{"$f":"IF(GORLIS!B12=\"\",\"\",+GORLIS!B12)","v":""},{"$f":"IF(GORLIS!C12=\"\",\"\",+GORLIS!C12)","v":""},{"$f":"IF(GORLIS!D12=\"\",\"\",+GORLIS!D12)","v":""},{"$f":"IF(GORLIS!E12=\"\",\"\",+GORLIS!E12)","v":""},{"$f":"IF(GORLIS!F12=\"\",\"\",+GORLIS!F12)","v":""},{"$f":"IF(GORLIS!G12=\"\",\"\",+GORLIS!G12)","v":""},{"$f":"IF(GORLIS!H12=\"\",\"\",+GORLIS!H12)","v":""},{"$f":"IF(GORLIS!I12=\"\",\"\",+GORLIS!I12)","v":""},{"$f":"IF(GORLIS!J12=\"\",\"\",+GORLIS!J12)","v":""},null,null,{"$f":"IF(GORLIS!M12=\"\",\"\",+GORLIS!M12)","v":""},null,{"$f":"IF(GORLIS!O12=\"\",\"\",+GORLIS!O12)","v":""},{"$f":"IF(GORLIS!P12=\"\",\"\",+GORLIS!P12)","v":""},{"$f":"IF(GORLIS!Q12=\"\",\"\",+GORLIS!Q12)","v":""},{"$f":"IF(GORLIS!R12=\"\",\"\",+GORLIS!R12)","v":""},{"$f":"IF(J11=\"\",\"\",CONCATENATE(GORLIS!T12,\"--\",J11))","v":""},null,null,0,null,0,null,{"$f":"IF(GORLIS!S12=\"\",\"\",+GORLIS!S12)","v":""}]
[null,{"$f":"IF(GORLIS!B13=\"\",\"\",B11+1)","v":""},{"$f":"IF(GORLIS!B13=\"\",\"\",+GORLIS!B13)","v":""},{"$f":"IF(GORLIS!C13=\"\",\"\",+GORLIS!C13)","v":""},{"$f":"IF(GORLIS!D13=\"\",\"\",+GORLIS!D13)","v":""},{"$f":"IF(GORLIS!E13=\"\",\"\",+GORLIS!E13)","v":""},{"$f":"IF(GORLIS!F13=\"\",\"\",+GORLIS!F13)","v":""},{"$f":"IF(GORLIS!G13=\"\",\"\",+GORLIS!G13)","v":""},{"$f":"IF(GORLIS!H13=\"\",\"\",+GORLIS!H13)","v":""},{"$f":"IF(GORLIS!I13=\"\",\"\",+GORLIS!I13)","v":""},{"$f":"IF(GORLIS!J13=\"\",\"\",+GORLIS!J13)","v":""},null,null,{"$f":"IF(GORLIS!M13=\"\",\"\",+GORLIS!M13)","v":""},null,{"$f":"IF(GORLIS!O13=\"\",\"\",+GORLIS!O13)","v":""},{"$f":"IF(GORLIS!P13=\"\",\"\",+GORLIS!P13)","v":""},{"$f":"IF(GORLIS!Q13=\"\",\"\",+GORLIS!Q13)","v":""},{"$f":"IF(GORLIS!R13=\"\",\"\",+GORLIS!R13)","v":""},{"$f":"IF(J12=\"\",\"\",CONCATENATE(GORLIS!T13,\"--\",J12))","v":""},null,null,0,null,0,null,{"$f":"IF(GORLIS!S13=\"\",\"\",+GORLIS!S13)","v":""}]
[null,{"$f":"IF(GORLIS!B14=\"\",\"\",B12+1)","v":""},{"$f":"IF(GORLIS!B14=\"\",\"\",+GORLIS!B14)","v":""},{"$f":"IF(GORLIS!C14=\"\",\"\",+GORLIS!C14)","v":""},{"$f":"IF(GORLIS!D14=\"\",\"\",+GORLIS!D14)","v":""},{"$f":"IF(GORLIS!E14=\"\",\"\",+GORLIS!E14)","v":""},{"$f":"IF(GORLIS!F14=\"\",\"\",+GORLIS!F14)","v":""},{"$f":"IF(GORLIS!G14=\"\",\"\",+GORLIS!G14)","v":""},{"$f":"IF(GORLIS!H14=\"\",\"\",+GORLIS!H14)","v":""},{"$f":"IF(GORLIS!I14=\"\",\"\",+GORLIS!I14)","v":""},{"$f":"IF(GORLIS!J14=\"\",\"\",+GORLIS!J14)","v":""},null,null,{"$f":"IF(GORLIS!M14=\"\",\"\",+GORLIS!M14)","v":""},null,{"$f":"IF(GORLIS!O14=\"\",\"\",+GORLIS!O14)","v":""},{"$f":"IF(GORLIS!P14=\"\",\"\",+GORLIS!P14)","v":""},{"$f":"IF(GORLIS!Q14=\"\",\"\",+GORLIS!Q14)","v":""},{"$f":"IF(GORLIS!R14=\"\",\"\",+GORLIS!R14)","v":""},{"$f":"IF(J13=\"\",\"\",CONCATENATE(GORLIS!T14,\"--\",J13))","v":""},null,null,0,null,0,null,{"$f":"IF(GORLIS!S14=\"\",\"\",+GORLIS!S14)","v":""}]
[null,{"$f":"IF(GORLIS!B15=\"\",\"\",B13+1)","v":""},{"$f":"IF(GORLIS!B15=\"\",\"\",+GORLIS!B15)","v":""},{"$f":"IF(GORLIS!C15=\"\",\"\",+GORLIS!C15)","v":""},{"$f":"IF(GORLIS!D15=\"\",\"\",+GORLIS!D15)","v":""},{"$f":"IF(GORLIS!E15=\"\",\"\",+GORLIS!E15)","v":""},{"$f":"IF(GORLIS!F15=\"\",\"\",+GORLIS!F15)","v":""},{"$f":"IF(GORLIS!G15=\"\",\"\",+GORLIS!G15)","v":""},{"$f":"IF(GORLIS!H15=\"\",\"\",+GORLIS!H15)","v":""},{"$f":"IF(GORLIS!I15=\"\",\"\",+GORLIS!I15)","v":""},{"$f":"IF(GORLIS!J15=\"\",\"\",+GORLIS!J15)","v":""},null,null,{"$f":"IF(GORLIS!M15=\"\",\"\",+GORLIS!M15)","v":""},null,{"$f":"IF(GORLIS!O15=\"\",\"\",+GORLIS!O15)","v":""},{"$f":"IF(GORLIS!P15=\"\",\"\",+GORLIS!P15)","v":""},{"$f":"IF(GORLIS!Q15=\"\",\"\",+GORLIS!Q15)","v":""},{"$f":"IF(GORLIS!R15=\"\",\"\",+GORLIS!R15)","v":""},{"$f":"IF(J14=\"\",\"\",CONCATENATE(GORLIS!T15,\"--\",J14))","v":""},null,null,0,null,0,null,{"$f":"IF(GORLIS!S15=\"\",\"\",+GORLIS!S15)","v":""}]
[null,{"$f":"IF(GORLIS!B16=\"\",\"\",B14+1)","v":""},{"$f":"IF(GORLIS!B16=\"\",\"\",+GORLIS!B16)","v":""},{"$f":"IF(GORLIS!C16=\"\",\"\",+GORLIS!C16)","v":""},{"$f":"IF(GORLIS!D16=\"\",\"\",+GORLIS!D16)","v":""},{"$f":"IF(GORLIS!E16=\"\",\"\",+GORLIS!E16)","v":""},{"$f":"IF(GORLIS!F16=\"\",\"\",+GORLIS!F16)","v":""},{"$f":"IF(GORLIS!G16=\"\",\"\",+GORLIS!G16)","v":""},{"$f":"IF(GORLIS!H16=\"\",\"\",+GORLIS!H16)","v":""},{"$f":"IF(GORLIS!I16=\"\",\"\",+GORLIS!I16)","v":""},{"$f":"IF(GORLIS!J16=\"\",\"\",+GORLIS!J16)","v":""},null,null,{"$f":"IF(GORLIS!M16=\"\",\"\",+GORLIS!M16)","v":""},null,{"$f":"IF(GORLIS!O16=\"\",\"\",+GORLIS!O16)","v":""},{"$f":"IF(GORLIS!P16=\"\",\"\",+GORLIS!P16)","v":""},{"$f":"IF(GORLIS!Q16=\"\",\"\",+GORLIS!Q16)","v":""},{"$f":"IF(GORLIS!R16=\"\",\"\",+GORLIS!R16)","v":""},{"$f":"IF(J15=\"\",\"\",CONCATENATE(GORLIS!T16,\"--\",J15))","v":""},null,null,0,null,0,null,{"$f":"IF(GORLIS!S16=\"\",\"\",+GORLIS!S16)","v":""}]
[null,{"$f":"IF(GORLIS!B17=\"\",\"\",B15+1)","v":""},{"$f":"IF(GORLIS!B17=\"\",\"\",+GORLIS!B17)","v":""},{"$f":"IF(GORLIS!C17=\"\",\"\",+GORLIS!C17)","v":""},{"$f":"IF(GORLIS!D17=\"\",\"\",+GORLIS!D17)","v":""},{"$f":"IF(GORLIS!E17=\"\",\"\",+GORLIS!E17)","v":""},{"$f":"IF(GORLIS!F17=\"\",\"\",+GORLIS!F17)","v":""},{"$f":"IF(GORLIS!G17=\"\",\"\",+GORLIS!G17)","v":""},{"$f":"IF(GORLIS!H17=\"\",\"\",+GORLIS!H17)","v":""},{"$f":"IF(GORLIS!I17=\"\",\"\",+GORLIS!I17)","v":""},{"$f":"IF(GORLIS!J17=\"\",\"\",+GORLIS!J17)","v":""},null,null,{"$f":"IF(GORLIS!M17=\"\",\"\",+GORLIS!M17)","v":""},null,{"$f":"IF(GORLIS!O17=\"\",\"\",+GORLIS!O17)","v":""},{"$f":"IF(GORLIS!P17=\"\",\"\",+GORLIS!P17)","v":""},{"$f":"IF(GORLIS!Q17=\"\",\"\",+GORLIS!Q17)","v":""},{"$f":"IF(GORLIS!R17=\"\",\"\",+GORLIS!R17)","v":""},{"$f":"IF(J16=\"\",\"\",CONCATENATE(GORLIS!T17,\"--\",J16))","v":""},null,null,0,null,0,null,{"$f":"IF(GORLIS!S17=\"\",\"\",+GORLIS!S17)","v":""}]
[null,{"$f":"IF(GORLIS!B18=\"\",\"\",B16+1)","v":""},{"$f":"IF(GORLIS!B18=\"\",\"\",+GORLIS!B18)","v":""},{"$f":"IF(GORLIS!C18=\"\",\"\",+GORLIS!C18)","v":""},{"$f":"IF(GORLIS!D18=\"\",\"\",+GORLIS!D18)","v":""},{"$f":"IF(GORLIS!E18=\"\",\"\",+GORLIS!E18)","v":""},{"$f":"IF(GORLIS!F18=\"\",\"\",+GORLIS!F18)","v":""},{"$f":"IF(GORLIS!G18=\"\",\"\",+GORLIS!G18)","v":""},{"$f":"IF(GORLIS!H18=\"\",\"\",+GORLIS!H18)","v":""},{"$f":"IF(GORLIS!I18=\"\",\"\",+GORLIS!I18)","v":""},{"$f":"IF(GORLIS!J18=\"\",\"\",+GORLIS!J18)","v":""},null,null,{"$f":"IF(GORLIS!M18=\"\",\"\",+GORLIS!M18)","v":""},null,{"$f":"IF(GORLIS!O18=\"\",\"\",+GORLIS!O18)","v":""},{"$f":"IF(GORLIS!P18=\"\",\"\",+GORLIS!P18)","v":""},{"$f":"IF(GORLIS!Q18=\"\",\"\",+GORLIS!Q18)","v":""},{"$f":"IF(GORLIS!R18=\"\",\"\",+GORLIS!R18)","v":""},{"$f":"IF(J17=\"\",\"\",CONCATENATE(GORLIS!T18,\"--\",J17))","v":""},null,null,0,null,0,null,{"$f":"IF(GORLIS!S18=\"\",\"\",+GORLIS!S18)","v":""}]
[null,{"$f":"IF(GORLIS!B19=\"\",\"\",B17+1)","v":""},{"$f":"IF(GORLIS!B19=\"\",\"\",+GORLIS!B19)","v":""},{"$f":"IF(GORLIS!C19=\"\",\"\",+GORLIS!C19)","v":""},{"$f":"IF(GORLIS!D19=\"\",\"\",+GORLIS!D19)","v":""},{"$f":"IF(GORLIS!E19=\"\",\"\",+GORLIS!E19)","v":""},{"$f":"IF(GORLIS!F19=\"\",\"\",+GORLIS!F19)","v":""},{"$f":"IF(GORLIS!G19=\"\",\"\",+GORLIS!G19)","v":""},{"$f":"IF(GORLIS!H19=\"\",\"\",+GORLIS!H19)","v":""},{"$f":"IF(GORLIS!I19=\"\",\"\",+GORLIS!I19)","v":""},{"$f":"IF(GORLIS!J19=\"\",\"\",+GORLIS!J19)","v":""},null,null,{"$f":"IF(GORLIS!M19=\"\",\"\",+GORLIS!M19)","v":""},null,{"$f":"IF(GORLIS!O19=\"\",\"\",+GORLIS!O19)","v":""},{"$f":"IF(GORLIS!P19=\"\",\"\",+GORLIS!P19)","v":""},{"$f":"IF(GORLIS!Q19=\"\",\"\",+GORLIS!Q19)","v":""},{"$f":"IF(GORLIS!R19=\"\",\"\",+GORLIS!R19)","v":""},{"$f":"IF(J18=\"\",\"\",CONCATENATE(GORLIS!T19,\"--\",J18))","v":""},null,null,0,null,0,null,{"$f":"IF(GORLIS!S19=\"\",\"\",+GORLIS!S19)","v":""}]
[null,{"$f":"IF(GORLIS!B20=\"\",\"\",B18+1)","v":""},{"$f":"IF(GORLIS!B20=\"\",\"\",+GORLIS!B20)","v":""},{"$f":"IF(GORLIS!C20=\"\",\"\",+GORLIS!C20)","v":""},{"$f":"IF(GORLIS!D20=\"\",\"\",+GORLIS!D20)","v":""},{"$f":"IF(GORLIS!E20=\"\",\"\",+GORLIS!E20)","v":""},{"$f":"IF(GORLIS!F20=\"\",\"\",+GORLIS!F20)","v":""},{"$f":"IF(GORLIS!G20=\"\",\"\",+GORLIS!G20)","v":""},{"$f":"IF(GORLIS!H20=\"\",\"\",+GORLIS!H20)","v":""},{"$f":"IF(GORLIS!I20=\"\",\"\",+GORLIS!I20)","v":""},{"$f":"IF(GORLIS!J20=\"\",\"\",+GORLIS!J20)","v":""},null,null,{"$f":"IF(GORLIS!M20=\"\",\"\",+GORLIS!M20)","v":""},null,{"$f":"IF(GORLIS!O20=\"\",\"\",+GORLIS!O20)","v":""},{"$f":"IF(GORLIS!P20=\"\",\"\",+GORLIS!P20)","v":""},{"$f":"IF(GORLIS!Q20=\"\",\"\",+GORLIS!Q20)","v":""},{"$f":"IF(GORLIS!R20=\"\",\"\",+GORLIS!R20)","v":""},{"$f":"IF(J19=\"\",\"\",CONCATENATE(GORLIS!T20,\"--\",J19))","v":""},null,null,0,null,0,null,{"$f":"IF(GORLIS!S20=\"\",\"\",+GORLIS!S20)","v":""}]
[null,{"$f":"IF(GORLIS!B21=\"\",\"\",B19+1)","v":""},{"$f":"IF(GORLIS!B21=\"\",\"\",+GORLIS!B21)","v":""},{"$f":"IF(GORLIS!C21=\"\",\"\",+GORLIS!C21)","v":""},{"$f":"IF(GORLIS!D21=\"\",\"\",+GORLIS!D21)","v":""},{"$f":"IF(GORLIS!E21=\"\",\"\",+GORLIS!E21)","v":""},{"$f":"IF(GORLIS!F21=\"\",\"\",+GORLIS!F21)","v":""},{"$f":"IF(GORLIS!G21=\"\",\"\",+GORLIS!G21)","v":""},{"$f":"IF(GORLIS!H21=\"\",\"\",+GORLIS!H21)","v":""},{"$f":"IF(GORLIS!I21=\"\",\"\",+GORLIS!I21)","v":""},{"$f":"IF(GORLIS!J21=\"\",\"\",+GORLIS!J21)","v":""},null,null,{"$f":"IF(GORLIS!M21=\"\",\"\",+GORLIS!M21)","v":""},null,{"$f":"IF(GORLIS!O21=\"\",\"\",+GORLIS!O21)","v":""},{"$f":"IF(GORLIS!P21=\"\",\"\",+GORLIS!P21)","v":""},{"$f":"IF(GORLIS!Q21=\"\",\"\",+GORLIS!Q21)","v":""},{"$f":"IF(GORLIS!R21=\"\",\"\",+GORLIS!R21)","v":""},{"$f":"IF(J20=\"\",\"\",CONCATENATE(GORLIS!T21,\"--\",J20))","v":""},null,null,0,null,0,null,{"$f":"IF(GORLIS!S21=\"\",\"\",+GORLIS!S21)","v":""}]
[null,{"$f":"IF(GORLIS!B22=\"\",\"\",B20+1)","v":""},{"$f":"IF(GORLIS!B22=\"\",\"\",+GORLIS!B22)","v":""},{"$f":"IF(GORLIS!C22=\"\",\"\",+GORLIS!C22)","v":""},{"$f":"IF(GORLIS!D22=\"\",\"\",+GORLIS!D22)","v":""},{"$f":"IF(GORLIS!E22=\"\",\"\",+GORLIS!E22)","v":""},{"$f":"IF(GORLIS!F22=\"\",\"\",+GORLIS!F22)","v":""},{"$f":"IF(GORLIS!G22=\"\",\"\",+GORLIS!G22)","v":""},{"$f":"IF(GORLIS!H22=\"\",\"\",+GORLIS!H22)","v":""},{"$f":"IF(GORLIS!I22=\"\",\"\",+GORLIS!I22)","v":""},{"$f":"IF(GORLIS!J22=\"\",\"\",+GORLIS!J22)","v":""},null,null,{"$f":"IF(GORLIS!M22=\"\",\"\",+GORLIS!M22)","v":""},null,{"$f":"IF(GORLIS!O22=\"\",\"\",+GORLIS!O22)","v":""},{"$f":"IF(GORLIS!P22=\"\",\"\",+GORLIS!P22)","v":""},{"$f":"IF(GORLIS!Q22=\"\",\"\",+GORLIS!Q22)","v":""},{"$f":"IF(GORLIS!R22=\"\",\"\",+GORLIS!R22)","v":""},{"$f":"IF(J21=\"\",\"\",CONCATENATE(GORLIS!T22,\"--\",J21))","v":""},null,null,0,null,0,null,{"$f":"IF(GORLIS!S22=\"\",\"\",+GORLIS!S22)","v":""}]
[null,{"$f":"IF(GORLIS!B23=\"\",\"\",B21+1)","v":""},{"$f":"IF(GORLIS!B23=\"\",\"\",+GORLIS!B23)","v":""},{"$f":"IF(GORLIS!C23=\"\",\"\",+GORLIS!C23)","v":""},{"$f":"IF(GORLIS!D23=\"\",\"\",+GORLIS!D23)","v":""},{"$f":"IF(GORLIS!E23=\"\",\"\",+GORLIS!E23)","v":""},{"$f":"IF(GORLIS!F23=\"\",\"\",+GORLIS!F23)","v":""},{"$f":"IF(GORLIS!G23=\"\",\"\",+GORLIS!G23)","v":""},{"$f":"IF(GORLIS!H23=\"\",\"\",+GORLIS!H23)","v":""},{"$f":"IF(GORLIS!I23=\"\",\"\",+GORLIS!I23)","v":""},{"$f":"IF(GORLIS!J23=\"\",\"\",+GORLIS!J23)","v":""},null,null,{"$f":"IF(GORLIS!M23=\"\",\"\",+GORLIS!M23)","v":""},null,{"$f":"IF(GORLIS!O23=\"\",\"\",+GORLIS!O23)","v":""},{"$f":"IF(GORLIS!P23=\"\",\"\",+GORLIS!P23)","v":""},{"$f":"IF(GORLIS!Q23=\"\",\"\",+GORLIS!Q23)","v":""},{"$f":"IF(GORLIS!R23=\"\",\"\",+GORLIS!R23)","v":""},{"$f":"IF(J22=\"\",\"\",CONCATENATE(GORLIS!T23,\"--\",J22))","v":""},null,null,0,null,0,null,{"$f":"IF(GORLIS!S23=\"\",\"\",+GORLIS!S23)","v":""}]
[null,{"$f":"IF(GORLIS!B24=\"\",\"\",B22+1)","v":""},{"$f":"IF(GORLIS!B24=\"\",\"\",+GORLIS!B24)","v":""},{"$f":"IF(GORLIS!C24=\"\",\"\",+GORLIS!C24)","v":""},{"$f":"IF(GORLIS!D24=\"\",\"\",+GORLIS!D24)","v":""},{"$f":"IF(GORLIS!E24=\"\",\"\",+GORLIS!E24)","v":""},{"$f":"IF(GORLIS!F24=\"\",\"\",+GORLIS!F24)","v":""},{"$f":"IF(GORLIS!G24=\"\",\"\",+GORLIS!G24)","v":""},{"$f":"IF(GORLIS!H24=\"\",\"\",+GORLIS!H24)","v":""},{"$f":"IF(GORLIS!I24=\"\",\"\",+GORLIS!I24)","v":""},{"$f":"IF(GORLIS!J24=\"\",\"\",+GORLIS!J24)","v":""},null,null,{"$f":"IF(GORLIS!M24=\"\",\"\",+GORLIS!M24)","v":""},null,{"$f":"IF(GORLIS!O24=\"\",\"\",+GORLIS!O24)","v":""},{"$f":"IF(GORLIS!P24=\"\",\"\",+GORLIS!P24)","v":""},{"$f":"IF(GORLIS!Q24=\"\",\"\",+GORLIS!Q24)","v":""},{"$f":"IF(GORLIS!R24=\"\",\"\",+GORLIS!R24)","v":""},{"$f":"IF(J23=\"\",\"\",CONCATENATE(GORLIS!T24,\"--\",J23))","v":""},null,null,0,null,0,null,{"$f":"IF(GORLIS!S24=\"\",\"\",+GORLIS!S24)","v":""}]
[null,{"$f":"IF(GORLIS!B25=\"\",\"\",B23+1)","v":""},{"$f":"IF(GORLIS!B25=\"\",\"\",+GORLIS!B25)","v":""},{"$f":"IF(GORLIS!C25=\"\",\"\",+GORLIS!C25)","v":""},{"$f":"IF(GORLIS!D25=\"\",\"\",+GORLIS!D25)","v":""},{"$f":"IF(GORLIS!E25=\"\",\"\",+GORLIS!E25)","v":""},{"$f":"IF(GORLIS!F25=\"\",\"\",+GORLIS!F25)","v":""},{"$f":"IF(GORLIS!G25=\"\",\"\",+GORLIS!G25)","v":""},{"$f":"IF(GORLIS!H25=\"\",\"\",+GORLIS!H25)","v":""},{"$f":"IF(GORLIS!I25=\"\",\"\",+GORLIS!I25)","v":""},{"$f":"IF(GORLIS!J25=\"\",\"\",+GORLIS!J25)","v":""},null,null,{"$f":"IF(GORLIS!M25=\"\",\"\",+GORLIS!M25)","v":""},null,{"$f":"IF(GORLIS!O25=\"\",\"\",+GORLIS!O25)","v":""},{"$f":"IF(GORLIS!P25=\"\",\"\",+GORLIS!P25)","v":""},{"$f":"IF(GORLIS!Q25=\"\",\"\",+GORLIS!Q25)","v":""},{"$f":"IF(GORLIS!R25=\"\",\"\",+GORLIS!R25)","v":""},{"$f":"IF(J24=\"\",\"\",CONCATENATE(GORLIS!T25,\"--\",J24))","v":""},null,null,0,null,0,null,{"$f":"IF(GORLIS!S25=\"\",\"\",+GORLIS!S25)","v":""}]
[null,{"$f":"IF(GORLIS!B26=\"\",\"\",B24+1)","v":""},{"$f":"IF(GORLIS!B26=\"\",\"\",+GORLIS!B26)","v":""},{"$f":"IF(GORLIS!C26=\"\",\"\",+GORLIS!C26)","v":""},{"$f":"IF(GORLIS!D26=\"\",\"\",+GORLIS!D26)","v":""},{"$f":"IF(GORLIS!E26=\"\",\"\",+GORLIS!E26)","v":""},{"$f":"IF(GORLIS!F26=\"\",\"\",+GORLIS!F26)","v":""},{"$f":"IF(GORLIS!G26=\"\",\"\",+GORLIS!G26)","v":""},{"$f":"IF(GORLIS!H26=\"\",\"\",+GORLIS!H26)","v":""},{"$f":"IF(GORLIS!I26=\"\",\"\",+GORLIS!I26)","v":""},{"$f":"IF(GORLIS!J26=\"\",\"\",+GORLIS!J26)","v":""},null,null,{"$f":"IF(GORLIS!M26=\"\",\"\",+GORLIS!M26)","v":""},null,{"$f":"IF(GORLIS!O26=\"\",\"\",+GORLIS!O26)","v":""},{"$f":"IF(GORLIS!P26=\"\",\"\",+GORLIS!P26)","v":""},{"$f":"IF(GORLIS!Q26=\"\",\"\",+GORLIS!Q26)","v":""},{"$f":"IF(GORLIS!R26=\"\",\"\",+GORLIS!R26)","v":""},{"$f":"IF(J25=\"\",\"\",CONCATENATE(GORLIS!T26,\"--\",J25))","v":""},null,null,0,null,0,null,{"$f":"IF(GORLIS!S26=\"\",\"\",+GORLIS!S26)","v":""}]
[null,{"$f":"IF(GORLIS!B27=\"\",\"\",B25+1)","v":""},{"$f":"IF(GORLIS!B27=\"\",\"\",+GORLIS!B27)","v":""},{"$f":"IF(GORLIS!C27=\"\",\"\",+GORLIS!C27)","v":""},{"$f":"IF(GORLIS!D27=\"\",\"\",+GORLIS!D27)","v":""},{"$f":"IF(GORLIS!E27=\"\",\"\",+GORLIS!E27)","v":""},{"$f":"IF(GORLIS!F27=\"\",\"\",+GORLIS!F27)","v":""},{"$f":"IF(GORLIS!G27=\"\",\"\",+GORLIS!G27)","v":""},{"$f":"IF(GORLIS!H27=\"\",\"\",+GORLIS!H27)","v":""},{"$f":"IF(GORLIS!I27=\"\",\"\",+GORLIS!I27)","v":""},{"$f":"IF(GORLIS!J27=\"\",\"\",+GORLIS!J27)","v":""},null,null,{"$f":"IF(GORLIS!M27=\"\",\"\",+GORLIS!M27)","v":""},null,{"$f":"IF(GORLIS!O27=\"\",\"\",+GORLIS!O27)","v":""},{"$f":"IF(GORLIS!P27=\"\",\"\",+GORLIS!P27)","v":""},{"$f":"IF(GORLIS!Q27=\"\",\"\",+GORLIS!Q27)","v":""},{"$f":"IF(GORLIS!R27=\"\",\"\",+GORLIS!R27)","v":""},{"$f":"IF(J26=\"\",\"\",CONCATENATE(GORLIS!T27,\"--\",J26))","v":""},null,null,0,null,0,null,{"$f":"IF(GORLIS!S27=\"\",\"\",+GORLIS!S27)","v":""}]
[null,{"$f":"IF(GORLIS!B28=\"\",\"\",B26+1)","v":""},{"$f":"IF(GORLIS!B28=\"\",\"\",+GORLIS!B28)","v":""},{"$f":"IF(GORLIS!C28=\"\",\"\",+GORLIS!C28)","v":""},{"$f":"IF(GORLIS!D28=\"\",\"\",+GORLIS!D28)","v":""},{"$f":"IF(GORLIS!E28=\"\",\"\",+GORLIS!E28)","v":""},{"$f":"IF(GORLIS!F28=\"\",\"\",+GORLIS!F28)","v":""},{"$f":"IF(GORLIS!G28=\"\",\"\",+GORLIS!G28)","v":""},{"$f":"IF(GORLIS!H28=\"\",\"\",+GORLIS!H28)","v":""},{"$f":"IF(GORLIS!I28=\"\",\"\",+GORLIS!I28)","v":""},{"$f":"IF(GORLIS!J28=\"\",\"\",+GORLIS!J28)","v":""},null,null,{"$f":"IF(GORLIS!M28=\"\",\"\",+GORLIS!M28)","v":""},null,{"$f":"IF(GORLIS!O28=\"\",\"\",+GORLIS!O28)","v":""},{"$f":"IF(GORLIS!P28=\"\",\"\",+GORLIS!P28)","v":""},{"$f":"IF(GORLIS!Q28=\"\",\"\",+GORLIS!Q28)","v":""},{"$f":"IF(GORLIS!R28=\"\",\"\",+GORLIS!R28)","v":""},{"$f":"IF(J27=\"\",\"\",CONCATENATE(GORLIS!T28,\"--\",J27))","v":""},null,null,0,null,0,null,{"$f":"IF(GORLIS!S28=\"\",\"\",+GORLIS!S28)","v":""}]
[null,{"$f":"IF(GORLIS!B29=\"\",\"\",B27+1)","v":""},{"$f":"IF(GORLIS!B29=\"\",\"\",+GORLIS!B29)","v":""},{"$f":"IF(GORLIS!C29=\"\",\"\",+GORLIS!C29)","v":""},{"$f":"IF(GORLIS!D29=\"\",\"\",+GORLIS!D29)","v":""},{"$f":"IF(GORLIS!E29=\"\",\"\",+GORLIS!E29)","v":""},{"$f":"IF(GORLIS!F29=\"\",\"\",+GORLIS!F29)","v":""},{"$f":"IF(GORLIS!G29=\"\",\"\",+GORLIS!G29)","v":""},{"$f":"IF(GORLIS!H29=\"\",\"\",+GORLIS!H29)","v":""},{"$f":"IF(GORLIS!I29=\"\",\"\",+GORLIS!I29)","v":""},{"$f":"IF(GORLIS!J29=\"\",\"\",+GORLIS!J29)","v":""},null,null,{"$f":"IF(GORLIS!M29=\"\",\"\",+GORLIS!M29)","v":""},null,{"$f":"IF(GORLIS!O29=\"\",\"\",+GORLIS!O29)","v":""},{"$f":"IF(GORLIS!P29=\"\",\"\",+GORLIS!P29)","v":""},{"$f":"IF(GORLIS!Q29=\"\",\"\",+GORLIS!Q29)","v":""},{"$f":"IF(GORLIS!R29=\"\",\"\",+GORLIS!R29)","v":""},{"$f":"IF(J28=\"\",\"\",CONCATENATE(GORLIS!T29,\"--\",J28))","v":""},null,null,0,null,0,null,{"$f":"IF(GORLIS!S29=\"\",\"\",+GORLIS!S29)","v":""}]
[null,{"$f":"IF(GORLIS!B30=\"\",\"\",B28+1)","v":""},{"$f":"IF(GORLIS!B30=\"\",\"\",+GORLIS!B30)","v":""},{"$f":"IF(GORLIS!C30=\"\",\"\",+GORLIS!C30)","v":""},{"$f":"IF(GORLIS!D30=\"\",\"\",+GORLIS!D30)","v":""},{"$f":"IF(GORLIS!E30=\"\",\"\",+GORLIS!E30)","v":""},{"$f":"IF(GORLIS!F30=\"\",\"\",+GORLIS!F30)","v":""},{"$f":"IF(GORLIS!G30=\"\",\"\",+GORLIS!G30)","v":""},{"$f":"IF(GORLIS!H30=\"\",\"\",+GORLIS!H30)","v":""},{"$f":"IF(GORLIS!I30=\"\",\"\",+GORLIS!I30)","v":""},{"$f":"IF(GORLIS!J30=\"\",\"\",+GORLIS!J30)","v":""},null,null,{"$f":"IF(GORLIS!M30=\"\",\"\",+GORLIS!M30)","v":""},null,{"$f":"IF(GORLIS!O30=\"\",\"\",+GORLIS!O30)","v":""},{"$f":"IF(GORLIS!P30=\"\",\"\",+GORLIS!P30)","v":""},{"$f":"IF(GORLIS!Q30=\"\",\"\",+GORLIS!Q30)","v":""},{"$f":"IF(GORLIS!R30=\"\",\"\",+GORLIS!R30)","v":""},{"$f":"IF(J29=\"\",\"\",CONCATENATE(GORLIS!T30,\"--\",J29))","v":""},null,null,0,null,0,null,{"$f":"IF(GORLIS!S30=\"\",\"\",+GORLIS!S30)","v":""}]
[null,{"$f":"IF(GORLIS!B31=\"\",\"\",B29+1)","v":""},{"$f":"IF(GORLIS!B31=\"\",\"\",+GORLIS!B31)","v":""},{"$f":"IF(GORLIS!C31=\"\",\"\",+GORLIS!C31)","v":""},{"$f":"IF(GORLIS!D31=\"\",\"\",+GORLIS!D31)","v":""},{"$f":"IF(GORLIS!E31=\"\",\"\",+GORLIS!E31)","v":""},{"$f":"IF(GORLIS!F31=\"\",\"\",+GORLIS!F31)","v":""},{"$f":"IF(GORLIS!G31=\"\",\"\",+GORLIS!G31)","v":""},{"$f":"IF(GORLIS!H31=\"\",\"\",+GORLIS!H31)","v":""},{"$f":"IF(GORLIS!I31=\"\",\"\",+GORLIS!I31)","v":""},{"$f":"IF(GORLIS!J31=\"\",\"\",+GORLIS!J31)","v":""},null,null,{"$f":"IF(GORLIS!M31=\"\",\"\",+GORLIS!M31)","v":""},null,{"$f":"IF(GORLIS!O31=\"\",\"\",+GORLIS!O31)","v":""},{"$f":"IF(GORLIS!P31=\"\",\"\",+GORLIS!P31)","v":""},{"$f":"IF(GORLIS!Q31=\"\",\"\",+GORLIS!Q31)","v":""},{"$f":"IF(GORLIS!R31=\"\",\"\",+GORLIS!R31)","v":""},{"$f":"IF(J30=\"\",\"\",CONCATENATE(GORLIS!T31,\"--\",J30))","v":""},null,null,0,null,0,null,{"$f":"IF(GORLIS!S31=\"\",\"\",+GORLIS!S31)","v":""}]
[null,{"$f":"IF(GORLIS!B32=\"\",\"\",B30+1)","v":""},{"$f":"IF(GORLIS!B32=\"\",\"\",+GORLIS!B32)","v":""},{"$f":"IF(GORLIS!C32=\"\",\"\",+GORLIS!C32)","v":""},{"$f":"IF(GORLIS!D32=\"\",\"\",+GORLIS!D32)","v":""},{"$f":"IF(GORLIS!E32=\"\",\"\",+GORLIS!E32)","v":""},{"$f":"IF(GORLIS!F32=\"\",\"\",+GORLIS!F32)","v":""},{"$f":"IF(GORLIS!G32=\"\",\"\",+GORLIS!G32)","v":""},{"$f":"IF(GORLIS!H32=\"\",\"\",+GORLIS!H32)","v":""},{"$f":"IF(GORLIS!I32=\"\",\"\",+GORLIS!I32)","v":""},{"$f":"IF(GORLIS!J32=\"\",\"\",+GORLIS!J32)","v":""},null,null,{"$f":"IF(GORLIS!M32=\"\",\"\",+GORLIS!M32)","v":""},null,{"$f":"IF(GORLIS!O32=\"\",\"\",+GORLIS!O32)","v":""},{"$f":"IF(GORLIS!P32=\"\",\"\",+GORLIS!P32)","v":""},{"$f":"IF(GORLIS!Q32=\"\",\"\",+GORLIS!Q32)","v":""},{"$f":"IF(GORLIS!R32=\"\",\"\",+GORLIS!R32)","v":""},{"$f":"IF(J31=\"\",\"\",CONCATENATE(GORLIS!T32,\"--\",J31))","v":""},null,null,0,null,0,null,{"$f":"IF(GORLIS!S32=\"\",\"\",+GORLIS!S32)","v":""}]
[null,{"$f":"IF(GORLIS!B33=\"\",\"\",B31+1)","v":""},{"$f":"IF(GORLIS!B33=\"\",\"\",+GORLIS!B33)","v":""},{"$f":"IF(GORLIS!C33=\"\",\"\",+GORLIS!C33)","v":""},{"$f":"IF(GORLIS!D33=\"\",\"\",+GORLIS!D33)","v":""},{"$f":"IF(GORLIS!E33=\"\",\"\",+GORLIS!E33)","v":""},{"$f":"IF(GORLIS!F33=\"\",\"\",+GORLIS!F33)","v":""},{"$f":"IF(GORLIS!G33=\"\",\"\",+GORLIS!G33)","v":""},{"$f":"IF(GORLIS!H33=\"\",\"\",+GORLIS!H33)","v":""},{"$f":"IF(GORLIS!I33=\"\",\"\",+GORLIS!I33)","v":""},{"$f":"IF(GORLIS!J33=\"\",\"\",+GORLIS!J33)","v":""},null,null,{"$f":"IF(GORLIS!M33=\"\",\"\",+GORLIS!M33)","v":""},null,{"$f":"IF(GORLIS!O33=\"\",\"\",+GORLIS!O33)","v":""},{"$f":"IF(GORLIS!P33=\"\",\"\",+GORLIS!P33)","v":""},{"$f":"IF(GORLIS!Q33=\"\",\"\",+GORLIS!Q33)","v":""},{"$f":"IF(GORLIS!R33=\"\",\"\",+GORLIS!R33)","v":""},{"$f":"IF(J32=\"\",\"\",CONCATENATE(GORLIS!T33,\"--\",J32))","v":""},null,null,0,null,0,null,{"$f":"IF(GORLIS!S33=\"\",\"\",+GORLIS!S33)","v":""}]
[null,{"$f":"IF(GORLIS!B34=\"\",\"\",B32+1)","v":""},{"$f":"IF(GORLIS!B34=\"\",\"\",+GORLIS!B34)","v":""},{"$f":"IF(GORLIS!C34=\"\",\"\",+GORLIS!C34)","v":""},{"$f":"IF(GORLIS!D34=\"\",\"\",+GORLIS!D34)","v":""},{"$f":"IF(GORLIS!E34=\"\",\"\",+GORLIS!E34)","v":""},{"$f":"IF(GORLIS!F34=\"\",\"\",+GORLIS!F34)","v":""},{"$f":"IF(GORLIS!G34=\"\",\"\",+GORLIS!G34)","v":""},{"$f":"IF(GORLIS!H34=\"\",\"\",+GORLIS!H34)","v":""},{"$f":"IF(GORLIS!I34=\"\",\"\",+GORLIS!I34)","v":""},{"$f":"IF(GORLIS!J34=\"\",\"\",+GORLIS!J34)","v":""},null,null,{"$f":"IF(GORLIS!M34=\"\",\"\",+GORLIS!M34)","v":""},null,{"$f":"IF(GORLIS!O34=\"\",\"\",+GORLIS!O34)","v":""},{"$f":"IF(GORLIS!P34=\"\",\"\",+GORLIS!P34)","v":""},{"$f":"IF(GORLIS!Q34=\"\",\"\",+GORLIS!Q34)","v":""},{"$f":"IF(GORLIS!R34=\"\",\"\",+GORLIS!R34)","v":""},{"$f":"IF(J33=\"\",\"\",CONCATENATE(GORLIS!T34,\"--\",J33))","v":""},null,null,0,null,0,null,{"$f":"IF(GORLIS!S34=\"\",\"\",+GORLIS!S34)","v":""}]
[null,{"$f":"IF(GORLIS!B35=\"\",\"\",B33+1)","v":""},{"$f":"IF(GORLIS!B35=\"\",\"\",+GORLIS!B35)","v":""},{"$f":"IF(GORLIS!C35=\"\",\"\",+GORLIS!C35)","v":""},{"$f":"IF(GORLIS!D35=\"\",\"\",+GORLIS!D35)","v":""},{"$f":"IF(GORLIS!E35=\"\",\"\",+GORLIS!E35)","v":""},{"$f":"IF(GORLIS!F35=\"\",\"\",+GORLIS!F35)","v":""},{"$f":"IF(GORLIS!G35=\"\",\"\",+GORLIS!G35)","v":""},{"$f":"IF(GORLIS!H35=\"\",\"\",+GORLIS!H35)","v":""},{"$f":"IF(GORLIS!I35=\"\",\"\",+GORLIS!I35)","v":""},{"$f":"IF(GORLIS!J35=\"\",\"\",+GORLIS!J35)","v":""},null,null,{"$f":"IF(GORLIS!M35=\"\",\"\",+GORLIS!M35)","v":""},null,{"$f":"IF(GORLIS!O35=\"\",\"\",+GORLIS!O35)","v":""},{"$f":"IF(GORLIS!P35=\"\",\"\",+GORLIS!P35)","v":""},{"$f":"IF(GORLIS!Q35=\"\",\"\",+GORLIS!Q35)","v":""},{"$f":"IF(GORLIS!R35=\"\",\"\",+GORLIS!R35)","v":""},{"$f":"IF(J34=\"\",\"\",CONCATENATE(GORLIS!T35,\"--\",J34))","v":""},null,null,0,null,0,null,{"$f":"IF(GORLIS!S35=\"\",\"\",+GORLIS!S35)","v":""}]
[null,{"$f":"IF(GORLIS!B36=\"\",\"\",B34+1)","v":""},{"$f":"IF(GORLIS!B36=\"\",\"\",+GORLIS!B36)","v":""},{"$f":"IF(GORLIS!C36=\"\",\"\",+GORLIS!C36)","v":""},{"$f":"IF(GORLIS!D36=\"\",\"\",+GORLIS!D36)","v":""},{"$f":"IF(GORLIS!E36=\"\",\"\",+GORLIS!E36)","v":""},{"$f":"IF(GORLIS!F36=\"\",\"\",+GORLIS!F36)","v":""},{"$f":"IF(GORLIS!G36=\"\",\"\",+GORLIS!G36)","v":""},{"$f":"IF(GORLIS!H36=\"\",\"\",+GORLIS!H36)","v":""},{"$f":"IF(GORLIS!I36=\"\",\"\",+GORLIS!I36)","v":""},{"$f":"IF(GORLIS!J36=\"\",\"\",+GORLIS!J36)","v":""},null,null,{"$f":"IF(GORLIS!M36=\"\",\"\",+GORLIS!M36)","v":""},null,{"$f":"IF(GORLIS!O36=\"\",\"\",+GORLIS!O36)","v":""},{"$f":"IF(GORLIS!P36=\"\",\"\",+GORLIS!P36)","v":""},{"$f":"IF(GORLIS!Q36=\"\",\"\",+GORLIS!Q36)","v":""},{"$f":"IF(GORLIS!R36=\"\",\"\",+GORLIS!R36)","v":""},{"$f":"IF(J35=\"\",\"\",CONCATENATE(GORLIS!T36,\"--\",J35))","v":""},null,null,0,null,0,null,{"$f":"IF(GORLIS!S36=\"\",\"\",+GORLIS!S36)","v":""}]
[null,{"$f":"IF(GORLIS!B37=\"\",\"\",B35+1)","v":""},{"$f":"IF(GORLIS!B37=\"\",\"\",+GORLIS!B37)","v":""},{"$f":"IF(GORLIS!C37=\"\",\"\",+GORLIS!C37)","v":""},{"$f":"IF(GORLIS!D37=\"\",\"\",+GORLIS!D37)","v":""},{"$f":"IF(GORLIS!E37=\"\",\"\",+GORLIS!E37)","v":""},{"$f":"IF(GORLIS!F37=\"\",\"\",+GORLIS!F37)","v":""},{"$f":"IF(GORLIS!G37=\"\",\"\",+GORLIS!G37)","v":""},{"$f":"IF(GORLIS!H37=\"\",\"\",+GORLIS!H37)","v":""},{"$f":"IF(GORLIS!I37=\"\",\"\",+GORLIS!I37)","v":""},{"$f":"IF(GORLIS!J37=\"\",\"\",+GORLIS!J37)","v":""},null,null,{"$f":"IF(GORLIS!M37=\"\",\"\",+GORLIS!M37)","v":""},null,{"$f":"IF(GORLIS!O37=\"\",\"\",+GORLIS!O37)","v":""},{"$f":"IF(GORLIS!P37=\"\",\"\",+GORLIS!P37)","v":""},{"$f":"IF(GORLIS!Q37=\"\",\"\",+GORLIS!Q37)","v":""},{"$f":"IF(GORLIS!R37=\"\",\"\",+GORLIS!R37)","v":""},{"$f":"IF(J36=\"\",\"\",CONCATENATE(GORLIS!T37,\"--\",J36))","v":""},null,null,0,null,0,null,{"$f":"IF(GORLIS!S37=\"\",\"\",+GORLIS!S37)","v":""}]
[null,{"$f":"IF(GORLIS!B38=\"\",\"\",B36+1)","v":""},{"$f":"IF(GORLIS!B38=\"\",\"\",+GORLIS!B38)","v":""},{"$f":"IF(GORLIS!C38=\"\",\"\",+GORLIS!C38)","v":""},{"$f":"IF(GORLIS!D38=\"\",\"\",+GORLIS!D38)","v":""},{"$f":"IF(GORLIS!E38=\"\",\"\",+GORLIS!E38)","v":""},{"$f":"IF(GORLIS!F38=\"\",\"\",+GORLIS!F38)","v":""},{"$f":"IF(GORLIS!G38=\"\",\"\",+GORLIS!G38)","v":""},{"$f":"IF(GORLIS!H38=\"\",\"\",+GORLIS!H38)","v":""},{"$f":"IF(GORLIS!I38=\"\",\"\",+GORLIS!I38)","v":""},{"$f":"IF(GORLIS!J38=\"\",\"\",+GORLIS!J38)","v":""},null,null,{"$f":"IF(GORLIS!M38=\"\",\"\",+GORLIS!M38)","v":""},null,{"$f":"IF(GORLIS!O38=\"\",\"\",+GORLIS!O38)","v":""},{"$f":"IF(GORLIS!P38=\"\",\"\",+GORLIS!P38)","v":""},{"$f":"IF(GORLIS!Q38=\"\",\"\",+GORLIS!Q38)","v":""},{"$f":"IF(GORLIS!R38=\"\",\"\",+GORLIS!R38)","v":""},{"$f":"IF(J37=\"\",\"\",CONCATENATE(GORLIS!T38,\"--\",J37))","v":""},null,null,0,null,0,null,{"$f":"IF(GORLIS!S38=\"\",\"\",+GORLIS!S38)","v":""}]
[null,{"$f":"IF(GORLIS!B39=\"\",\"\",B37+1)","v":""},{"$f":"IF(GORLIS!B39=\"\",\"\",+GORLIS!B39)","v":""},{"$f":"IF(GORLIS!C39=\"\",\"\",+GORLIS!C39)","v":""},{"$f":"IF(GORLIS!D39=\"\",\"\",+GORLIS!D39)","v":""},{"$f":"IF(GORLIS!E39=\"\",\"\",+GORLIS!E39)","v":""},{"$f":"IF(GORLIS!F39=\"\",\"\",+GORLIS!F39)","v":""},{"$f":"IF(GORLIS!G39=\"\",\"\",+GORLIS!G39)","v":""},{"$f":"IF(GORLIS!H39=\"\",\"\",+GORLIS!H39)","v":""},{"$f":"IF(GORLIS!I39=\"\",\"\",+GORLIS!I39)","v":""},{"$f":"IF(GORLIS!J39=\"\",\"\",+GORLIS!J39)","v":""},null,null,{"$f":"IF(GORLIS!M39=\"\",\"\",+GORLIS!M39)","v":""},null,{"$f":"IF(GORLIS!O39=\"\",\"\",+GORLIS!O39)","v":""},{"$f":"IF(GORLIS!P39=\"\",\"\",+GORLIS!P39)","v":""},{"$f":"IF(GORLIS!Q39=\"\",\"\",+GORLIS!Q39)","v":""},{"$f":"IF(GORLIS!R39=\"\",\"\",+GORLIS!R39)","v":""},{"$f":"IF(J38=\"\",\"\",CONCATENATE(GORLIS!T39,\"--\",J38))","v":""},null,null,0,null,0,null,{"$f":"IF(GORLIS!S39=\"\",\"\",+GORLIS!S39)","v":""}]
[null,{"$f":"IF(GORLIS!B40=\"\",\"\",B38+1)","v":""},{"$f":"IF(GORLIS!B40=\"\",\"\",+GORLIS!B40)","v":""},{"$f":"IF(GORLIS!C40=\"\",\"\",+GORLIS!C40)","v":""},{"$f":"IF(GORLIS!D40=\"\",\"\",+GORLIS!D40)","v":""},{"$f":"IF(GORLIS!E40=\"\",\"\",+GORLIS!E40)","v":""},{"$f":"IF(GORLIS!F40=\"\",\"\",+GORLIS!F40)","v":""},{"$f":"IF(GORLIS!G40=\"\",\"\",+GORLIS!G40)","v":""},{"$f":"IF(GORLIS!H40=\"\",\"\",+GORLIS!H40)","v":""},{"$f":"IF(GORLIS!I40=\"\",\"\",+GORLIS!I40)","v":""},{"$f":"IF(GORLIS!J40=\"\",\"\",+GORLIS!J40)","v":""},null,null,{"$f":"IF(GORLIS!M40=\"\",\"\",+GORLIS!M40)","v":""},null,{"$f":"IF(GORLIS!O40=\"\",\"\",+GORLIS!O40)","v":""},{"$f":"IF(GORLIS!P40=\"\",\"\",+GORLIS!P40)","v":""},{"$f":"IF(GORLIS!Q40=\"\",\"\",+GORLIS!Q40)","v":""},{"$f":"IF(GORLIS!R40=\"\",\"\",+GORLIS!R40)","v":""},{"$f":"IF(J39=\"\",\"\",CONCATENATE(GORLIS!T40,\"--\",J39))","v":""},null,null,0,null,0,null,{"$f":"IF(GORLIS!S40=\"\",\"\",+GORLIS!S40)","v":""}]
[null,{"$f":"IF(GORLIS!B41=\"\",\"\",B39+1)","v":""},{"$f":"IF(GORLIS!B41=\"\",\"\",+GORLIS!B41)","v":""},{"$f":"IF(GORLIS!C41=\"\",\"\",+GORLIS!C41)","v":""},{"$f":"IF(GORLIS!D41=\"\",\"\",+GORLIS!D41)","v":""},{"$f":"IF(GORLIS!E41=\"\",\"\",+GORLIS!E41)","v":""},{"$f":"IF(GORLIS!F41=\"\",\"\",+GORLIS!F41)","v":""},{"$f":"IF(GORLIS!G41=\"\",\"\",+GORLIS!G41)","v":""},{"$f":"IF(GORLIS!H41=\"\",\"\",+GORLIS!H41)","v":""},{"$f":"IF(GORLIS!I41=\"\",\"\",+GORLIS!I41)","v":""},{"$f":"IF(GORLIS!J41=\"\",\"\",+GORLIS!J41)","v":""},null,null,{"$f":"IF(GORLIS!M41=\"\",\"\",+GORLIS!M41)","v":""},null,{"$f":"IF(GORLIS!O41=\"\",\"\",+GORLIS!O41)","v":""},{"$f":"IF(GORLIS!P41=\"\",\"\",+GORLIS!P41)","v":""},{"$f":"IF(GORLIS!Q41=\"\",\"\",+GORLIS!Q41)","v":""},{"$f":"IF(GORLIS!R41=\"\",\"\",+GORLIS!R41)","v":""},{"$f":"IF(J40=\"\",\"\",CONCATENATE(GORLIS!T41,\"--\",J40))","v":""},null,null,0,null,0,null,{"$f":"IF(GORLIS!S41=\"\",\"\",+GORLIS!S41)","v":""}]
[null,{"$f":"IF(GORLIS!B42=\"\",\"\",B40+1)","v":""},{"$f":"IF(GORLIS!B42=\"\",\"\",+GORLIS!B42)","v":""},{"$f":"IF(GORLIS!C42=\"\",\"\",+GORLIS!C42)","v":""},{"$f":"IF(GORLIS!D42=\"\",\"\",+GORLIS!D42)","v":""},{"$f":"IF(GORLIS!E42=\"\",\"\",+GORLIS!E42)","v":""},{"$f":"IF(GORLIS!F42=\"\",\"\",+GORLIS!F42)","v":""},{"$f":"IF(GORLIS!G42=\"\",\"\",+GORLIS!G42)","v":""},{"$f":"IF(GORLIS!H42=\"\",\"\",+GORLIS!H42)","v":""},{"$f":"IF(GORLIS!I42=\"\",\"\",+GORLIS!I42)","v":""},{"$f":"IF(GORLIS!J42=\"\",\"\",+GORLIS!J42)","v":""},null,null,{"$f":"IF(GORLIS!M42=\"\",\"\",+GORLIS!M42)","v":""},null,{"$f":"IF(GORLIS!O42=\"\",\"\",+GORLIS!O42)","v":""},{"$f":"IF(GORLIS!P42=\"\",\"\",+GORLIS!P42)","v":""},{"$f":"IF(GORLIS!Q42=\"\",\"\",+GORLIS!Q42)","v":""},{"$f":"IF(GORLIS!R42=\"\",\"\",+GORLIS!R42)","v":""},{"$f":"IF(J41=\"\",\"\",CONCATENATE(GORLIS!T42,\"--\",J41))","v":""},null,null,0,null,0,null,{"$f":"IF(GORLIS!S42=\"\",\"\",+GORLIS!S42)","v":""}]
[null,{"$f":"IF(GORLIS!B43=\"\",\"\",B41+1)","v":""},{"$f":"IF(GORLIS!B43=\"\",\"\",+GORLIS!B43)","v":""},{"$f":"IF(GORLIS!C43=\"\",\"\",+GORLIS!C43)","v":""},{"$f":"IF(GORLIS!D43=\"\",\"\",+GORLIS!D43)","v":""},{"$f":"IF(GORLIS!E43=\"\",\"\",+GORLIS!E43)","v":""},{"$f":"IF(GORLIS!F43=\"\",\"\",+GORLIS!F43)","v":""},{"$f":"IF(GORLIS!G43=\"\",\"\",+GORLIS!G43)","v":""},{"$f":"IF(GORLIS!H43=\"\",\"\",+GORLIS!H43)","v":""},{"$f":"IF(GORLIS!I43=\"\",\"\",+GORLIS!I43)","v":""},{"$f":"IF(GORLIS!J43=\"\",\"\",+GORLIS!J43)","v":""},null,null,{"$f":"IF(GORLIS!M43=\"\",\"\",+GORLIS!M43)","v":""},null,{"$f":"IF(GORLIS!O43=\"\",\"\",+GORLIS!O43)","v":""},{"$f":"IF(GORLIS!P43=\"\",\"\",+GORLIS!P43)","v":""},{"$f":"IF(GORLIS!Q43=\"\",\"\",+GORLIS!Q43)","v":""},{"$f":"IF(GORLIS!R43=\"\",\"\",+GORLIS!R43)","v":""},{"$f":"IF(J42=\"\",\"\",CONCATENATE(GORLIS!T43,\"--\",J42))","v":""},null,null,0,null,0,null,{"$f":"IF(GORLIS!S43=\"\",\"\",+GORLIS!S43)","v":""}]
[null,{"$f":"IF(GORLIS!B44=\"\",\"\",B42+1)","v":""},{"$f":"IF(GORLIS!B44=\"\",\"\",+GORLIS!B44)","v":""},{"$f":"IF(GORLIS!C44=\"\",\"\",+GORLIS!C44)","v":""},{"$f":"IF(GORLIS!D44=\"\",\"\",+GORLIS!D44)","v":""},{"$f":"IF(GORLIS!E44=\"\",\"\",+GORLIS!E44)","v":""},{"$f":"IF(GORLIS!F44=\"\",\"\",+GORLIS!F44)","v":""},{"$f":"IF(GORLIS!G44=\"\",\"\",+GORLIS!G44)","v":""},{"$f":"IF(GORLIS!H44=\"\",\"\",+GORLIS!H44)","v":""},{"$f":"IF(GORLIS!I44=\"\",\"\",+GORLIS!I44)","v":""},{"$f":"IF(GORLIS!J44=\"\",\"\",+GORLIS!J44)","v":""},null,null,{"$f":"IF(GORLIS!M44=\"\",\"\",+GORLIS!M44)","v":""},null,{"$f":"IF(GORLIS!O44=\"\",\"\",+GORLIS!O44)","v":""},{"$f":"IF(GORLIS!P44=\"\",\"\",+GORLIS!P44)","v":""},{"$f":"IF(GORLIS!Q44=\"\",\"\",+GORLIS!Q44)","v":""},{"$f":"IF(GORLIS!R44=\"\",\"\",+GORLIS!R44)","v":""},{"$f":"IF(J43=\"\",\"\",CONCATENATE(GORLIS!T44,\"--\",J43))","v":""},null,null,0,null,0,null,{"$f":"IF(GORLIS!S44=\"\",\"\",+GORLIS!S44)","v":""}]
[null,{"$f":"IF(GORLIS!B45=\"\",\"\",B43+1)","v":""},{"$f":"IF(GORLIS!B45=\"\",\"\",+GORLIS!B45)","v":""},{"$f":"IF(GORLIS!C45=\"\",\"\",+GORLIS!C45)","v":""},{"$f":"IF(GORLIS!D45=\"\",\"\",+GORLIS!D45)","v":""},{"$f":"IF(GORLIS!E45=\"\",\"\",+GORLIS!E45)","v":""},{"$f":"IF(GORLIS!F45=\"\",\"\",+GORLIS!F45)","v":""},{"$f":"IF(GORLIS!G45=\"\",\"\",+GORLIS!G45)","v":""},{"$f":"IF(GORLIS!H45=\"\",\"\",+GORLIS!H45)","v":""},{"$f":"IF(GORLIS!I45=\"\",\"\",+GORLIS!I45)","v":""},{"$f":"IF(GORLIS!J45=\"\",\"\",+GORLIS!J45)","v":""},null,null,{"$f":"IF(GORLIS!M45=\"\",\"\",+GORLIS!M45)","v":""},null,{"$f":"IF(GORLIS!O45=\"\",\"\",+GORLIS!O45)","v":""},{"$f":"IF(GORLIS!P45=\"\",\"\",+GORLIS!P45)","v":""},{"$f":"IF(GORLIS!Q45=\"\",\"\",+GORLIS!Q45)","v":""},{"$f":"IF(GORLIS!R45=\"\",\"\",+GORLIS!R45)","v":""},{"$f":"IF(J44=\"\",\"\",CONCATENATE(GORLIS!T45,\"--\",J44))","v":""},null,null,0,null,0,null,{"$f":"IF(GORLIS!S45=\"\",\"\",+GORLIS!S45)","v":""}]
[null,{"$f":"IF(GORLIS!B46=\"\",\"\",B44+1)","v":""},{"$f":"IF(GORLIS!B46=\"\",\"\",+GORLIS!B46)","v":""},{"$f":"IF(GORLIS!C46=\"\",\"\",+GORLIS!C46)","v":""},{"$f":"IF(GORLIS!D46=\"\",\"\",+GORLIS!D46)","v":""},{"$f":"IF(GORLIS!E46=\"\",\"\",+GORLIS!E46)","v":""},{"$f":"IF(GORLIS!F46=\"\",\"\",+GORLIS!F46)","v":""},{"$f":"IF(GORLIS!G46=\"\",\"\",+GORLIS!G46)","v":""},{"$f":"IF(GORLIS!H46=\"\",\"\",+GORLIS!H46)","v":""},{"$f":"IF(GORLIS!I46=\"\",\"\",+GORLIS!I46)","v":""},{"$f":"IF(GORLIS!J46=\"\",\"\",+GORLIS!J46)","v":""},null,null,{"$f":"IF(GORLIS!M46=\"\",\"\",+GORLIS!M46)","v":""},null,{"$f":"IF(GORLIS!O46=\"\",\"\",+GORLIS!O46)","v":""},{"$f":"IF(GORLIS!P46=\"\",\"\",+GORLIS!P46)","v":""},{"$f":"IF(GORLIS!Q46=\"\",\"\",+GORLIS!Q46)","v":""},{"$f":"IF(GORLIS!R46=\"\",\"\",+GORLIS!R46)","v":""},{"$f":"IF(J45=\"\",\"\",CONCATENATE(GORLIS!T46,\"--\",J45))","v":""},null,null,0,null,0,null,{"$f":"IF(GORLIS!S46=\"\",\"\",+GORLIS!S46)","v":""}]
[null,{"$f":"IF(GORLIS!B47=\"\",\"\",B45+1)","v":""},{"$f":"IF(GORLIS!B47=\"\",\"\",+GORLIS!B47)","v":""},{"$f":"IF(GORLIS!C47=\"\",\"\",+GORLIS!C47)","v":""},{"$f":"IF(GORLIS!D47=\"\",\"\",+GORLIS!D47)","v":""},{"$f":"IF(GORLIS!E47=\"\",\"\",+GORLIS!E47)","v":""},{"$f":"IF(GORLIS!F47=\"\",\"\",+GORLIS!F47)","v":""},{"$f":"IF(GORLIS!G47=\"\",\"\",+GORLIS!G47)","v":""},{"$f":"IF(GORLIS!H47=\"\",\"\",+GORLIS!H47)","v":""},{"$f":"IF(GORLIS!I47=\"\",\"\",+GORLIS!I47)","v":""},{"$f":"IF(GORLIS!J47=\"\",\"\",+GORLIS!J47)","v":""},null,null,{"$f":"IF(GORLIS!M47=\"\",\"\",+GORLIS!M47)","v":""},null,{"$f":"IF(GORLIS!O47=\"\",\"\",+GORLIS!O47)","v":""},{"$f":"IF(GORLIS!P47=\"\",\"\",+GORLIS!P47)","v":""},{"$f":"IF(GORLIS!Q47=\"\",\"\",+GORLIS!Q47)","v":""},{"$f":"IF(GORLIS!R47=\"\",\"\",+GORLIS!R47)","v":""},{"$f":"IF(J46=\"\",\"\",CONCATENATE(GORLIS!T47,\"--\",J46))","v":""},null,null,0,null,0,null,{"$f":"IF(GORLIS!S47=\"\",\"\",+GORLIS!S47)","v":""}]
[null,{"$f":"IF(GORLIS!B48=\"\",\"\",B46+1)","v":""},{"$f":"IF(GORLIS!B48=\"\",\"\",+GORLIS!B48)","v":""},{"$f":"IF(GORLIS!C48=\"\",\"\",+GORLIS!C48)","v":""},{"$f":"IF(GORLIS!D48=\"\",\"\",+GORLIS!D48)","v":""},{"$f":"IF(GORLIS!E48=\"\",\"\",+GORLIS!E48)","v":""},{"$f":"IF(GORLIS!F48=\"\",\"\",+GORLIS!F48)","v":""},{"$f":"IF(GORLIS!G48=\"\",\"\",+GORLIS!G48)","v":""},{"$f":"IF(GORLIS!H48=\"\",\"\",+GORLIS!H48)","v":""},{"$f":"IF(GORLIS!I48=\"\",\"\",+GORLIS!I48)","v":""},{"$f":"IF(GORLIS!J48=\"\",\"\",+GORLIS!J48)","v":""},null,null,{"$f":"IF(GORLIS!M48=\"\",\"\",+GORLIS!M48)","v":""},null,{"$f":"IF(GORLIS!O48=\"\",\"\",+GORLIS!O48)","v":""},{"$f":"IF(GORLIS!P48=\"\",\"\",+GORLIS!P48)","v":""},{"$f":"IF(GORLIS!Q48=\"\",\"\",+GORLIS!Q48)","v":""},{"$f":"IF(GORLIS!R48=\"\",\"\",+GORLIS!R48)","v":""},{"$f":"IF(J47=\"\",\"\",CONCATENATE(GORLIS!T48,\"--\",J47))","v":""},null,null,0,null,0,null,{"$f":"IF(GORLIS!S48=\"\",\"\",+GORLIS!S48)","v":""}]
[null,{"$f":"IF(GORLIS!B49=\"\",\"\",B47+1)","v":""},{"$f":"IF(GORLIS!B49=\"\",\"\",+GORLIS!B49)","v":""},{"$f":"IF(GORLIS!C49=\"\",\"\",+GORLIS!C49)","v":""},{"$f":"IF(GORLIS!D49=\"\",\"\",+GORLIS!D49)","v":""},{"$f":"IF(GORLIS!E49=\"\",\"\",+GORLIS!E49)","v":""},{"$f":"IF(GORLIS!F49=\"\",\"\",+GORLIS!F49)","v":""},{"$f":"IF(GORLIS!G49=\"\",\"\",+GORLIS!G49)","v":""},{"$f":"IF(GORLIS!H49=\"\",\"\",+GORLIS!H49)","v":""},{"$f":"IF(GORLIS!I49=\"\",\"\",+GORLIS!I49)","v":""},{"$f":"IF(GORLIS!J49=\"\",\"\",+GORLIS!J49)","v":""},null,null,{"$f":"IF(GORLIS!M49=\"\",\"\",+GORLIS!M49)","v":""},null,{"$f":"IF(GORLIS!O49=\"\",\"\",+GORLIS!O49)","v":""},{"$f":"IF(GORLIS!P49=\"\",\"\",+GORLIS!P49)","v":""},{"$f":"IF(GORLIS!Q49=\"\",\"\",+GORLIS!Q49)","v":""},{"$f":"IF(GORLIS!R49=\"\",\"\",+GORLIS!R49)","v":""},{"$f":"IF(J48=\"\",\"\",CONCATENATE(GORLIS!T49,\"--\",J48))","v":""},null,null,0,null,0,null,{"$f":"IF(GORLIS!S49=\"\",\"\",+GORLIS!S49)","v":""}]
[null,{"$f":"IF(GORLIS!B50=\"\",\"\",B48+1)","v":""},{"$f":"IF(GORLIS!B50=\"\",\"\",+GORLIS!B50)","v":""},{"$f":"IF(GORLIS!C50=\"\",\"\",+GORLIS!C50)","v":""},{"$f":"IF(GORLIS!D50=\"\",\"\",+GORLIS!D50)","v":""},{"$f":"IF(GORLIS!E50=\"\",\"\",+GORLIS!E50)","v":""},{"$f":"IF(GORLIS!F50=\"\",\"\",+GORLIS!F50)","v":""},{"$f":"IF(GORLIS!G50=\"\",\"\",+GORLIS!G50)","v":""},{"$f":"IF(GORLIS!H50=\"\",\"\",+GORLIS!H50)","v":""},{"$f":"IF(GORLIS!I50=\"\",\"\",+GORLIS!I50)","v":""},{"$f":"IF(GORLIS!J50=\"\",\"\",+GORLIS!J50)","v":""},null,null,{"$f":"IF(GORLIS!M50=\"\",\"\",+GORLIS!M50)","v":""},null,{"$f":"IF(GORLIS!O50=\"\",\"\",+GORLIS!O50)","v":""},{"$f":"IF(GORLIS!P50=\"\",\"\",+GORLIS!P50)","v":""},{"$f":"IF(GORLIS!Q50=\"\",\"\",+GORLIS!Q50)","v":""},{"$f":"IF(GORLIS!R50=\"\",\"\",+GORLIS!R50)","v":""},{"$f":"IF(J49=\"\",\"\",CONCATENATE(GORLIS!T50,\"--\",J49))","v":""},null,null,0,null,0,null,{"$f":"IF(GORLIS!S50=\"\",\"\",+GORLIS!S50)","v":""}]
[null,{"$f":"IF(GORLIS!B51=\"\",\"\",B49+1)","v":""},{"$f":"IF(GORLIS!B51=\"\",\"\",+GORLIS!B51)","v":""},{"$f":"IF(GORLIS!C51=\"\",\"\",+GORLIS!C51)","v":""},{"$f":"IF(GORLIS!D51=\"\",\"\",+GORLIS!D51)","v":""},{"$f":"IF(GORLIS!E51=\"\",\"\",+GORLIS!E51)","v":""},{"$f":"IF(GORLIS!F51=\"\",\"\",+GORLIS!F51)","v":""},{"$f":"IF(GORLIS!G51=\"\",\"\",+GORLIS!G51)","v":""},{"$f":"IF(GORLIS!H51=\"\",\"\",+GORLIS!H51)","v":""},{"$f":"IF(GORLIS!I51=\"\",\"\",+GORLIS!I51)","v":""},{"$f":"IF(GORLIS!J51=\"\",\"\",+GORLIS!J51)","v":""},null,null,{"$f":"IF(GORLIS!M51=\"\",\"\",+GORLIS!M51)","v":""},null,{"$f":"IF(GORLIS!O51=\"\",\"\",+GORLIS!O51)","v":""},{"$f":"IF(GORLIS!P51=\"\",\"\",+GORLIS!P51)","v":""},{"$f":"IF(GORLIS!Q51=\"\",\"\",+GORLIS!Q51)","v":""},{"$f":"IF(GORLIS!R51=\"\",\"\",+GORLIS!R51)","v":""},{"$f":"IF(J50=\"\",\"\",CONCATENATE(GORLIS!T51,\"--\",J50))","v":""},null,null,0,null,0,null,{"$f":"IF(GORLIS!S51=\"\",\"\",+GORLIS!S51)","v":""}]
[null,{"$f":"IF(GORLIS!B52=\"\",\"\",B50+1)","v":""},{"$f":"IF(GORLIS!B52=\"\",\"\",+GORLIS!B52)","v":""},{"$f":"IF(GORLIS!C52=\"\",\"\",+GORLIS!C52)","v":""},{"$f":"IF(GORLIS!D52=\"\",\"\",+GORLIS!D52)","v":""},{"$f":"IF(GORLIS!E52=\"\",\"\",+GORLIS!E52)","v":""},{"$f":"IF(GORLIS!F52=\"\",\"\",+GORLIS!F52)","v":""},{"$f":"IF(GORLIS!G52=\"\",\"\",+GORLIS!G52)","v":""},{"$f":"IF(GORLIS!H52=\"\",\"\",+GORLIS!H52)","v":""},{"$f":"IF(GORLIS!I52=\"\",\"\",+GORLIS!I52)","v":""},{"$f":"IF(GORLIS!J52=\"\",\"\",+GORLIS!J52)","v":""},null,null,{"$f":"IF(GORLIS!M52=\"\",\"\",+GORLIS!M52)","v":""},null,{"$f":"IF(GORLIS!O52=\"\",\"\",+GORLIS!O52)","v":""},{"$f":"IF(GORLIS!P52=\"\",\"\",+GORLIS!P52)","v":""},{"$f":"IF(GORLIS!Q52=\"\",\"\",+GORLIS!Q52)","v":""},{"$f":"IF(GORLIS!R52=\"\",\"\",+GORLIS!R52)","v":""},{"$f":"IF(J51=\"\",\"\",CONCATENATE(GORLIS!T52,\"--\",J51))","v":""},null,null,0,null,0,null,{"$f":"IF(GORLIS!S52=\"\",\"\",+GORLIS!S52)","v":""}]
[null,{"$f":"IF(GORLIS!B53=\"\",\"\",B51+1)","v":""},{"$f":"IF(GORLIS!B53=\"\",\"\",+GORLIS!B53)","v":""},{"$f":"IF(GORLIS!C53=\"\",\"\",+GORLIS!C53)","v":""},{"$f":"IF(GORLIS!D53=\"\",\"\",+GORLIS!D53)","v":""},{"$f":"IF(GORLIS!E53=\"\",\"\",+GORLIS!E53)","v":""},{"$f":"IF(GORLIS!F53=\"\",\"\",+GORLIS!F53)","v":""},{"$f":"IF(GORLIS!G53=\"\",\"\",+GORLIS!G53)","v":""},{"$f":"IF(GORLIS!H53=\"\",\"\",+GORLIS!H53)","v":""},{"$f":"IF(GORLIS!I53=\"\",\"\",+GORLIS!I53)","v":""},{"$f":"IF(GORLIS!J53=\"\",\"\",+GORLIS!J53)","v":""},null,null,{"$f":"IF(GORLIS!M53=\"\",\"\",+GORLIS!M53)","v":""},null,{"$f":"IF(GORLIS!O53=\"\",\"\",+GORLIS!O53)","v":""},{"$f":"IF(GORLIS!P53=\"\",\"\",+GORLIS!P53)","v":""},{"$f":"IF(GORLIS!Q53=\"\",\"\",+GORLIS!Q53)","v":""},{"$f":"IF(GORLIS!R53=\"\",\"\",+GORLIS!R53)","v":""},{"$f":"IF(J52=\"\",\"\",CONCATENATE(GORLIS!T53,\"--\",J52))","v":""},null,null,0,null,0,null,{"$f":"IF(GORLIS!S53=\"\",\"\",+GORLIS!S53)","v":""}]
[null,{"$f":"IF(GORLIS!B54=\"\",\"\",B52+1)","v":""},{"$f":"IF(GORLIS!B54=\"\",\"\",+GORLIS!B54)","v":""},{"$f":"IF(GORLIS!C54=\"\",\"\",+GORLIS!C54)","v":""},{"$f":"IF(GORLIS!D54=\"\",\"\",+GORLIS!D54)","v":""},{"$f":"IF(GORLIS!E54=\"\",\"\",+GORLIS!E54)","v":""},{"$f":"IF(GORLIS!F54=\"\",\"\",+GORLIS!F54)","v":""},{"$f":"IF(GORLIS!G54=\"\",\"\",+GORLIS!G54)","v":""},{"$f":"IF(GORLIS!H54=\"\",\"\",+GORLIS!H54)","v":""},{"$f":"IF(GORLIS!I54=\"\",\"\",+GORLIS!I54)","v":""},{"$f":"IF(GORLIS!J54=\"\",\"\",+GORLIS!J54)","v":""},null,null,{"$f":"IF(GORLIS!M54=\"\",\"\",+GORLIS!M54)","v":""},null,{"$f":"IF(GORLIS!O54=\"\",\"\",+GORLIS!O54)","v":""},{"$f":"IF(GORLIS!P54=\"\",\"\",+GORLIS!P54)","v":""},{"$f":"IF(GORLIS!Q54=\"\",\"\",+GORLIS!Q54)","v":""},{"$f":"IF(GORLIS!R54=\"\",\"\",+GORLIS!R54)","v":""},{"$f":"IF(J53=\"\",\"\",CONCATENATE(GORLIS!T54,\"--\",J53))","v":""},null,null,0,null,0,null,{"$f":"IF(GORLIS!S54=\"\",\"\",+GORLIS!S54)","v":""}]
[null,{"$f":"IF(GORLIS!B55=\"\",\"\",B53+1)","v":""},{"$f":"IF(GORLIS!B55=\"\",\"\",+GORLIS!B55)","v":""},{"$f":"IF(GORLIS!C55=\"\",\"\",+GORLIS!C55)","v":""},{"$f":"IF(GORLIS!D55=\"\",\"\",+GORLIS!D55)","v":""},{"$f":"IF(GORLIS!E55=\"\",\"\",+GORLIS!E55)","v":""},{"$f":"IF(GORLIS!F55=\"\",\"\",+GORLIS!F55)","v":""},{"$f":"IF(GORLIS!G55=\"\",\"\",+GORLIS!G55)","v":""},{"$f":"IF(GORLIS!H55=\"\",\"\",+GORLIS!H55)","v":""},{"$f":"IF(GORLIS!I55=\"\",\"\",+GORLIS!I55)","v":""},{"$f":"IF(GORLIS!J55=\"\",\"\",+GORLIS!J55)","v":""},null,null,{"$f":"IF(GORLIS!M55=\"\",\"\",+GORLIS!M55)","v":""},null,{"$f":"IF(GORLIS!O55=\"\",\"\",+GORLIS!O55)","v":""},{"$f":"IF(GORLIS!P55=\"\",\"\",+GORLIS!P55)","v":""},{"$f":"IF(GORLIS!Q55=\"\",\"\",+GORLIS!Q55)","v":""},{"$f":"IF(GORLIS!R55=\"\",\"\",+GORLIS!R55)","v":""},{"$f":"IF(J54=\"\",\"\",CONCATENATE(GORLIS!T55,\"--\",J54))","v":""},null,null,0,null,0,null,{"$f":"IF(GORLIS!S55=\"\",\"\",+GORLIS!S55)","v":""}]
[null,{"$f":"IF(GORLIS!B56=\"\",\"\",B54+1)","v":""},{"$f":"IF(GORLIS!B56=\"\",\"\",+GORLIS!B56)","v":""},{"$f":"IF(GORLIS!C56=\"\",\"\",+GORLIS!C56)","v":""},{"$f":"IF(GORLIS!D56=\"\",\"\",+GORLIS!D56)","v":""},{"$f":"IF(GORLIS!E56=\"\",\"\",+GORLIS!E56)","v":""},{"$f":"IF(GORLIS!F56=\"\",\"\",+GORLIS!F56)","v":""},{"$f":"IF(GORLIS!G56=\"\",\"\",+GORLIS!G56)","v":""},{"$f":"IF(GORLIS!H56=\"\",\"\",+GORLIS!H56)","v":""},{"$f":"IF(GORLIS!I56=\"\",\"\",+GORLIS!I56)","v":""},{"$f":"IF(GORLIS!J56=\"\",\"\",+GORLIS!J56)","v":""},null,null,{"$f":"IF(GORLIS!M56=\"\",\"\",+GORLIS!M56)","v":""},null,{"$f":"IF(GORLIS!O56=\"\",\"\",+GORLIS!O56)","v":""},{"$f":"IF(GORLIS!P56=\"\",\"\",+GORLIS!P56)","v":""},{"$f":"IF(GORLIS!Q56=\"\",\"\",+GORLIS!Q56)","v":""},{"$f":"IF(GORLIS!R56=\"\",\"\",+GORLIS!R56)","v":""},{"$f":"IF(J55=\"\",\"\",CONCATENATE(GORLIS!T56,\"--\",J55))","v":""},null,null,0,null,0,null,{"$f":"IF(GORLIS!S56=\"\",\"\",+GORLIS!S56)","v":""}]
[null,{"$f":"IF(GORLIS!B57=\"\",\"\",B55+1)","v":""},{"$f":"IF(GORLIS!B57=\"\",\"\",+GORLIS!B57)","v":""},{"$f":"IF(GORLIS!C57=\"\",\"\",+GORLIS!C57)","v":""},{"$f":"IF(GORLIS!D57=\"\",\"\",+GORLIS!D57)","v":""},{"$f":"IF(GORLIS!E57=\"\",\"\",+GORLIS!E57)","v":""},{"$f":"IF(GORLIS!F57=\"\",\"\",+GORLIS!F57)","v":""},{"$f":"IF(GORLIS!G57=\"\",\"\",+GORLIS!G57)","v":""},{"$f":"IF(GORLIS!H57=\"\",\"\",+GORLIS!H57)","v":""},{"$f":"IF(GORLIS!I57=\"\",\"\",+GORLIS!I57)","v":""},{"$f":"IF(GORLIS!J57=\"\",\"\",+GORLIS!J57)","v":""},null,null,{"$f":"IF(GORLIS!M57=\"\",\"\",+GORLIS!M57)","v":""},null,{"$f":"IF(GORLIS!O57=\"\",\"\",+GORLIS!O57)","v":""},{"$f":"IF(GORLIS!P57=\"\",\"\",+GORLIS!P57)","v":""},{"$f":"IF(GORLIS!Q57=\"\",\"\",+GORLIS!Q57)","v":""},{"$f":"IF(GORLIS!R57=\"\",\"\",+GORLIS!R57)","v":""},{"$f":"IF(J56=\"\",\"\",CONCATENATE(GORLIS!T57,\"--\",J56))","v":""},null,null,0,null,0,null,{"$f":"IF(GORLIS!S57=\"\",\"\",+GORLIS!S57)","v":""}]
[null,{"$f":"IF(GORLIS!B58=\"\",\"\",B56+1)","v":""},{"$f":"IF(GORLIS!B58=\"\",\"\",+GORLIS!B58)","v":""},{"$f":"IF(GORLIS!C58=\"\",\"\",+GORLIS!C58)","v":""},{"$f":"IF(GORLIS!D58=\"\",\"\",+GORLIS!D58)","v":""},{"$f":"IF(GORLIS!E58=\"\",\"\",+GORLIS!E58)","v":""},{"$f":"IF(GORLIS!F58=\"\",\"\",+GORLIS!F58)","v":""},{"$f":"IF(GORLIS!G58=\"\",\"\",+GORLIS!G58)","v":""},{"$f":"IF(GORLIS!H58=\"\",\"\",+GORLIS!H58)","v":""},{"$f":"IF(GORLIS!I58=\"\",\"\",+GORLIS!I58)","v":""},{"$f":"IF(GORLIS!J58=\"\",\"\",+GORLIS!J58)","v":""},null,null,{"$f":"IF(GORLIS!M58=\"\",\"\",+GORLIS!M58)","v":""},null,{"$f":"IF(GORLIS!O58=\"\",\"\",+GORLIS!O58)","v":""},{"$f":"IF(GORLIS!P58=\"\",\"\",+GORLIS!P58)","v":""},{"$f":"IF(GORLIS!Q58=\"\",\"\",+GORLIS!Q58)","v":""},{"$f":"IF(GORLIS!R58=\"\",\"\",+GORLIS!R58)","v":""},{"$f":"IF(J57=\"\",\"\",CONCATENATE(GORLIS!T58,\"--\",J57))","v":""},null,null,0,null,0,null,{"$f":"IF(GORLIS!S58=\"\",\"\",+GORLIS!S58)","v":""}]
[null,{"$f":"IF(GORLIS!B59=\"\",\"\",B57+1)","v":""},{"$f":"IF(GORLIS!B59=\"\",\"\",+GORLIS!B59)","v":""},{"$f":"IF(GORLIS!C59=\"\",\"\",+GORLIS!C59)","v":""},{"$f":"IF(GORLIS!D59=\"\",\"\",+GORLIS!D59)","v":""},{"$f":"IF(GORLIS!E59=\"\",\"\",+GORLIS!E59)","v":""},{"$f":"IF(GORLIS!F59=\"\",\"\",+GORLIS!F59)","v":""},{"$f":"IF(GORLIS!G59=\"\",\"\",+GORLIS!G59)","v":""},{"$f":"IF(GORLIS!H59=\"\",\"\",+GORLIS!H59)","v":""},{"$f":"IF(GORLIS!I59=\"\",\"\",+GORLIS!I59)","v":""},{"$f":"IF(GORLIS!J59=\"\",\"\",+GORLIS!J59)","v":""},null,null,{"$f":"IF(GORLIS!M59=\"\",\"\",+GORLIS!M59)","v":""},null,{"$f":"IF(GORLIS!O59=\"\",\"\",+GORLIS!O59)","v":""},{"$f":"IF(GORLIS!P59=\"\",\"\",+GORLIS!P59)","v":""},{"$f":"IF(GORLIS!Q59=\"\",\"\",+GORLIS!Q59)","v":""},{"$f":"IF(GORLIS!R59=\"\",\"\",+GORLIS!R59)","v":""},{"$f":"IF(J58=\"\",\"\",CONCATENATE(GORLIS!T59,\"--\",J58))","v":""},null,null,0,null,0,null,{"$f":"IF(GORLIS!S59=\"\",\"\",+GORLIS!S59)","v":""}]
[null,{"$f":"IF(GORLIS!B60=\"\",\"\",B58+1)","v":""},{"$f":"IF(GORLIS!B60=\"\",\"\",+GORLIS!B60)","v":""},{"$f":"IF(GORLIS!C60=\"\",\"\",+GORLIS!C60)","v":""},{"$f":"IF(GORLIS!D60=\"\",\"\",+GORLIS!D60)","v":""},{"$f":"IF(GORLIS!E60=\"\",\"\",+GORLIS!E60)","v":""},{"$f":"IF(GORLIS!F60=\"\",\"\",+GORLIS!F60)","v":""},{"$f":"IF(GORLIS!G60=\"\",\"\",+GORLIS!G60)","v":""},{"$f":"IF(GORLIS!H60=\"\",\"\",+GORLIS!H60)","v":""},{"$f":"IF(GORLIS!I60=\"\",\"\",+GORLIS!I60)","v":""},{"$f":"IF(GORLIS!J60=\"\",\"\",+GORLIS!J60)","v":""},null,null,{"$f":"IF(GORLIS!M60=\"\",\"\",+GORLIS!M60)","v":""},null,{"$f":"IF(GORLIS!O60=\"\",\"\",+GORLIS!O60)","v":""},{"$f":"IF(GORLIS!P60=\"\",\"\",+GORLIS!P60)","v":""},{"$f":"IF(GORLIS!Q60=\"\",\"\",+GORLIS!Q60)","v":""},{"$f":"IF(GORLIS!R60=\"\",\"\",+GORLIS!R60)","v":""},{"$f":"IF(J59=\"\",\"\",CONCATENATE(GORLIS!T60,\"--\",J59))","v":""},null,null,0,null,0,null,{"$f":"IF(GORLIS!S60=\"\",\"\",+GORLIS!S60)","v":""}]
[null,{"$f":"IF(GORLIS!B61=\"\",\"\",B59+1)","v":""},{"$f":"IF(GORLIS!B61=\"\",\"\",+GORLIS!B61)","v":""},{"$f":"IF(GORLIS!C61=\"\",\"\",+GORLIS!C61)","v":""},{"$f":"IF(GORLIS!D61=\"\",\"\",+GORLIS!D61)","v":""},{"$f":"IF(GORLIS!E61=\"\",\"\",+GORLIS!E61)","v":""},{"$f":"IF(GORLIS!F61=\"\",\"\",+GORLIS!F61)","v":""},{"$f":"IF(GORLIS!G61=\"\",\"\",+GORLIS!G61)","v":""},{"$f":"IF(GORLIS!H61=\"\",\"\",+GORLIS!H61)","v":""},{"$f":"IF(GORLIS!I61=\"\",\"\",+GORLIS!I61)","v":""},{"$f":"IF(GORLIS!J61=\"\",\"\",+GORLIS!J61)","v":""},null,null,{"$f":"IF(GORLIS!M61=\"\",\"\",+GORLIS!M61)","v":""},null,{"$f":"IF(GORLIS!O61=\"\",\"\",+GORLIS!O61)","v":""},{"$f":"IF(GORLIS!P61=\"\",\"\",+GORLIS!P61)","v":""},{"$f":"IF(GORLIS!Q61=\"\",\"\",+GORLIS!Q61)","v":""},{"$f":"IF(GORLIS!R61=\"\",\"\",+GORLIS!R61)","v":""},{"$f":"IF(J60=\"\",\"\",CONCATENATE(GORLIS!T61,\"--\",J60))","v":""},null,null,0,null,0,null,{"$f":"IF(GORLIS!S61=\"\",\"\",+GORLIS!S61)","v":""}]
[null,{"$f":"IF(GORLIS!B62=\"\",\"\",B60+1)","v":""},{"$f":"IF(GORLIS!B62=\"\",\"\",+GORLIS!B62)","v":""},{"$f":"IF(GORLIS!C62=\"\",\"\",+GORLIS!C62)","v":""},{"$f":"IF(GORLIS!D62=\"\",\"\",+GORLIS!D62)","v":""},{"$f":"IF(GORLIS!E62=\"\",\"\",+GORLIS!E62)","v":""},{"$f":"IF(GORLIS!F62=\"\",\"\",+GORLIS!F62)","v":""},{"$f":"IF(GORLIS!G62=\"\",\"\",+GORLIS!G62)","v":""},{"$f":"IF(GORLIS!H62=\"\",\"\",+GORLIS!H62)","v":""},{"$f":"IF(GORLIS!I62=\"\",\"\",+GORLIS!I62)","v":""},{"$f":"IF(GORLIS!J62=\"\",\"\",+GORLIS!J62)","v":""},null,null,{"$f":"IF(GORLIS!M62=\"\",\"\",+GORLIS!M62)","v":""},null,{"$f":"IF(GORLIS!O62=\"\",\"\",+GORLIS!O62)","v":""},{"$f":"IF(GORLIS!P62=\"\",\"\",+GORLIS!P62)","v":""},{"$f":"IF(GORLIS!Q62=\"\",\"\",+GORLIS!Q62)","v":""},{"$f":"IF(GORLIS!R62=\"\",\"\",+GORLIS!R62)","v":""},{"$f":"IF(J61=\"\",\"\",CONCATENATE(GORLIS!T62,\"--\",J61))","v":""},null,null,0,null,0,null,{"$f":"IF(GORLIS!S62=\"\",\"\",+GORLIS!S62)","v":""}]
[null,{"$f":"IF(GORLIS!B63=\"\",\"\",B61+1)","v":""},{"$f":"IF(GORLIS!B63=\"\",\"\",+GORLIS!B63)","v":""},{"$f":"IF(GORLIS!C63=\"\",\"\",+GORLIS!C63)","v":""},{"$f":"IF(GORLIS!D63=\"\",\"\",+GORLIS!D63)","v":""},{"$f":"IF(GORLIS!E63=\"\",\"\",+GORLIS!E63)","v":""},{"$f":"IF(GORLIS!F63=\"\",\"\",+GORLIS!F63)","v":""},{"$f":"IF(GORLIS!G63=\"\",\"\",+GORLIS!G63)","v":""},{"$f":"IF(GORLIS!H63=\"\",\"\",+GORLIS!H63)","v":""},{"$f":"IF(GORLIS!I63=\"\",\"\",+GORLIS!I63)","v":""},{"$f":"IF(GORLIS!J63=\"\",\"\",+GORLIS!J63)","v":""},null,null,{"$f":"IF(GORLIS!M63=\"\",\"\",+GORLIS!M63)","v":""},null,{"$f":"IF(GORLIS!O63=\"\",\"\",+GORLIS!O63)","v":""},{"$f":"IF(GORLIS!P63=\"\",\"\",+GORLIS!P63)","v":""},{"$f":"IF(GORLIS!Q63=\"\",\"\",+GORLIS!Q63)","v":""},{"$f":"IF(GORLIS!R63=\"\",\"\",+GORLIS!R63)","v":""},{"$f":"IF(J62=\"\",\"\",CONCATENATE(GORLIS!T63,\"--\",J62))","v":""},null,null,0,null,0,null,{"$f":"IF(GORLIS!S63=\"\",\"\",+GORLIS!S63)","v":""}]
[null,{"$f":"IF(GORLIS!B64=\"\",\"\",B62+1)","v":""},{"$f":"IF(GORLIS!B64=\"\",\"\",+GORLIS!B64)","v":""},{"$f":"IF(GORLIS!C64=\"\",\"\",+GORLIS!C64)","v":""},{"$f":"IF(GORLIS!D64=\"\",\"\",+GORLIS!D64)","v":""},{"$f":"IF(GORLIS!E64=\"\",\"\",+GORLIS!E64)","v":""},{"$f":"IF(GORLIS!F64=\"\",\"\",+GORLIS!F64)","v":""},{"$f":"IF(GORLIS!G64=\"\",\"\",+GORLIS!G64)","v":""},{"$f":"IF(GORLIS!H64=\"\",\"\",+GORLIS!H64)","v":""},{"$f":"IF(GORLIS!I64=\"\",\"\",+GORLIS!I64)","v":""},{"$f":"IF(GORLIS!J64=\"\",\"\",+GORLIS!J64)","v":""},null,null,{"$f":"IF(GORLIS!M64=\"\",\"\",+GORLIS!M64)","v":""},null,{"$f":"IF(GORLIS!O64=\"\",\"\",+GORLIS!O64)","v":""},{"$f":"IF(GORLIS!P64=\"\",\"\",+GORLIS!P64)","v":""},{"$f":"IF(GORLIS!Q64=\"\",\"\",+GORLIS!Q64)","v":""},{"$f":"IF(GORLIS!R64=\"\",\"\",+GORLIS!R64)","v":""},{"$f":"IF(J63=\"\",\"\",CONCATENATE(GORLIS!T64,\"--\",J63))","v":""},null,null,0,null,0,null,{"$f":"IF(GORLIS!S64=\"\",\"\",+GORLIS!S64)","v":""}]
[null,{"$f":"IF(GORLIS!B65=\"\",\"\",B63+1)","v":""},{"$f":"IF(GORLIS!B65=\"\",\"\",+GORLIS!B65)","v":""},{"$f":"IF(GORLIS!C65=\"\",\"\",+GORLIS!C65)","v":""},{"$f":"IF(GORLIS!D65=\"\",\"\",+GORLIS!D65)","v":""},{"$f":"IF(GORLIS!E65=\"\",\"\",+GORLIS!E65)","v":""},{"$f":"IF(GORLIS!F65=\"\",\"\",+GORLIS!F65)","v":""},{"$f":"IF(GORLIS!G65=\"\",\"\",+GORLIS!G65)","v":""},{"$f":"IF(GORLIS!H65=\"\",\"\",+GORLIS!H65)","v":""},{"$f":"IF(GORLIS!I65=\"\",\"\",+GORLIS!I65)","v":""},{"$f":"IF(GORLIS!J65=\"\",\"\",+GORLIS!J65)","v":""},null,null,{"$f":"IF(GORLIS!M65=\"\",\"\",+GORLIS!M65)","v":""},null,{"$f":"IF(GORLIS!O65=\"\",\"\",+GORLIS!O65)","v":""},{"$f":"IF(GORLIS!P65=\"\",\"\",+GORLIS!P65)","v":""},{"$f":"IF(GORLIS!Q65=\"\",\"\",+GORLIS!Q65)","v":""},{"$f":"IF(GORLIS!R65=\"\",\"\",+GORLIS!R65)","v":""},{"$f":"IF(J64=\"\",\"\",CONCATENATE(GORLIS!T65,\"--\",J64))","v":""},null,null,0,null,0,null,{"$f":"IF(GORLIS!S65=\"\",\"\",+GORLIS!S65)","v":""}]
[null,{"$f":"IF(GORLIS!B66=\"\",\"\",B64+1)","v":""},{"$f":"IF(GORLIS!B66=\"\",\"\",+GORLIS!B66)","v":""},{"$f":"IF(GORLIS!C66=\"\",\"\",+GORLIS!C66)","v":""},{"$f":"IF(GORLIS!D66=\"\",\"\",+GORLIS!D66)","v":""},{"$f":"IF(GORLIS!E66=\"\",\"\",+GORLIS!E66)","v":""},{"$f":"IF(GORLIS!F66=\"\",\"\",+GORLIS!F66)","v":""},{"$f":"IF(GORLIS!G66=\"\",\"\",+GORLIS!G66)","v":""},{"$f":"IF(GORLIS!H66=\"\",\"\",+GORLIS!H66)","v":""},{"$f":"IF(GORLIS!I66=\"\",\"\",+GORLIS!I66)","v":""},{"$f":"IF(GORLIS!J66=\"\",\"\",+GORLIS!J66)","v":""},null,null,{"$f":"IF(GORLIS!M66=\"\",\"\",+GORLIS!M66)","v":""},null,{"$f":"IF(GORLIS!O66=\"\",\"\",+GORLIS!O66)","v":""},{"$f":"IF(GORLIS!P66=\"\",\"\",+GORLIS!P66)","v":""},{"$f":"IF(GORLIS!Q66=\"\",\"\",+GORLIS!Q66)","v":""},{"$f":"IF(GORLIS!R66=\"\",\"\",+GORLIS!R66)","v":""},{"$f":"IF(J65=\"\",\"\",CONCATENATE(GORLIS!T66,\"--\",J65))","v":""},null,null,0,null,0,null,{"$f":"IF(GORLIS!S66=\"\",\"\",+GORLIS!S66)","v":""}]
[null,{"$f":"IF(GORLIS!B67=\"\",\"\",B65+1)","v":""},{"$f":"IF(GORLIS!B67=\"\",\"\",+GORLIS!B67)","v":""},{"$f":"IF(GORLIS!C67=\"\",\"\",+GORLIS!C67)","v":""},{"$f":"IF(GORLIS!D67=\"\",\"\",+GORLIS!D67)","v":""},{"$f":"IF(GORLIS!E67=\"\",\"\",+GORLIS!E67)","v":""},{"$f":"IF(GORLIS!F67=\"\",\"\",+GORLIS!F67)","v":""},{"$f":"IF(GORLIS!G67=\"\",\"\",+GORLIS!G67)","v":""},{"$f":"IF(GORLIS!H67=\"\",\"\",+GORLIS!H67)","v":""},{"$f":"IF(GORLIS!I67=\"\",\"\",+GORLIS!I67)","v":""},{"$f":"IF(GORLIS!J67=\"\",\"\",+GORLIS!J67)","v":""},null,null,{"$f":"IF(GORLIS!M67=\"\",\"\",+GORLIS!M67)","v":""},null,{"$f":"IF(GORLIS!O67=\"\",\"\",+GORLIS!O67)","v":""},{"$f":"IF(GORLIS!P67=\"\",\"\",+GORLIS!P67)","v":""},{"$f":"IF(GORLIS!Q67=\"\",\"\",+GORLIS!Q67)","v":""},{"$f":"IF(GORLIS!R67=\"\",\"\",+GORLIS!R67)","v":""},{"$f":"IF(J66=\"\",\"\",CONCATENATE(GORLIS!T67,\"--\",J66))","v":""},null,null,0,null,0,null,{"$f":"IF(GORLIS!S67=\"\",\"\",+GORLIS!S67)","v":""}]
[null,{"$f":"IF(GORLIS!B68=\"\",\"\",B66+1)","v":""},{"$f":"IF(GORLIS!B68=\"\",\"\",+GORLIS!B68)","v":""},{"$f":"IF(GORLIS!C68=\"\",\"\",+GORLIS!C68)","v":""},{"$f":"IF(GORLIS!D68=\"\",\"\",+GORLIS!D68)","v":""},{"$f":"IF(GORLIS!E68=\"\",\"\",+GORLIS!E68)","v":""},{"$f":"IF(GORLIS!F68=\"\",\"\",+GORLIS!F68)","v":""},{"$f":"IF(GORLIS!G68=\"\",\"\",+GORLIS!G68)","v":""},{"$f":"IF(GORLIS!H68=\"\",\"\",+GORLIS!H68)","v":""},{"$f":"IF(GORLIS!I68=\"\",\"\",+GORLIS!I68)","v":""},{"$f":"IF(GORLIS!J68=\"\",\"\",+GORLIS!J68)","v":""},null,null,{"$f":"IF(GORLIS!M68=\"\",\"\",+GORLIS!M68)","v":""},null,{"$f":"IF(GORLIS!O68=\"\",\"\",+GORLIS!O68)","v":""},{"$f":"IF(GORLIS!P68=\"\",\"\",+GORLIS!P68)","v":""},{"$f":"IF(GORLIS!Q68=\"\",\"\",+GORLIS!Q68)","v":""},{"$f":"IF(GORLIS!R68=\"\",\"\",+GORLIS!R68)","v":""},{"$f":"IF(J67=\"\",\"\",CONCATENATE(GORLIS!T68,\"--\",J67))","v":""},null,null,0,null,0,null,{"$f":"IF(GORLIS!S68=\"\",\"\",+GORLIS!S68)","v":""}]
[null,{"$f":"IF(GORLIS!B69=\"\",\"\",B67+1)","v":""},{"$f":"IF(GORLIS!B69=\"\",\"\",+GORLIS!B69)","v":""},{"$f":"IF(GORLIS!C69=\"\",\"\",+GORLIS!C69)","v":""},{"$f":"IF(GORLIS!D69=\"\",\"\",+GORLIS!D69)","v":""},{"$f":"IF(GORLIS!E69=\"\",\"\",+GORLIS!E69)","v":""},{"$f":"IF(GORLIS!F69=\"\",\"\",+GORLIS!F69)","v":""},{"$f":"IF(GORLIS!G69=\"\",\"\",+GORLIS!G69)","v":""},{"$f":"IF(GORLIS!H69=\"\",\"\",+GORLIS!H69)","v":""},{"$f":"IF(GORLIS!I69=\"\",\"\",+GORLIS!I69)","v":""},{"$f":"IF(GORLIS!J69=\"\",\"\",+GORLIS!J69)","v":""},null,null,{"$f":"IF(GORLIS!M69=\"\",\"\",+GORLIS!M69)","v":""},null,{"$f":"IF(GORLIS!O69=\"\",\"\",+GORLIS!O69)","v":""},{"$f":"IF(GORLIS!P69=\"\",\"\",+GORLIS!P69)","v":""},{"$f":"IF(GORLIS!Q69=\"\",\"\",+GORLIS!Q69)","v":""},{"$f":"IF(GORLIS!R69=\"\",\"\",+GORLIS!R69)","v":""},{"$f":"IF(J68=\"\",\"\",CONCATENATE(GORLIS!T69,\"--\",J68))","v":""},null,null,{"$f":"IF(V68-U68>M68,+M68,IF((V68-U68)>10,10,(V68-U68)))","v":0},null,{"$f":"IF(G68=\"\",0,IF(W68<=0,0,IF(W68*((G68*0.5)+G68)>=X68,+X68,W68*((G68*0.5)+G68))))","v":0},null,{"$f":"IF(GORLIS!S69=\"\",\"\",+GORLIS!S69)","v":""}]
[null,{"$f":"IF(GORLIS!B70=\"\",\"\",B68+1)","v":""},{"$f":"IF(GORLIS!B70=\"\",\"\",+GORLIS!B70)","v":""},{"$f":"IF(GORLIS!C70=\"\",\"\",+GORLIS!C70)","v":""},{"$f":"IF(GORLIS!D70=\"\",\"\",+GORLIS!D70)","v":""},{"$f":"IF(GORLIS!E70=\"\",\"\",+GORLIS!E70)","v":""},{"$f":"IF(GORLIS!F70=\"\",\"\",+GORLIS!F70)","v":""},{"$f":"IF(GORLIS!G70=\"\",\"\",+GORLIS!G70)","v":""},{"$f":"IF(GORLIS!H70=\"\",\"\",+GORLIS!H70)","v":""},{"$f":"IF(GORLIS!I70=\"\",\"\",+GORLIS!I70)","v":""},{"$f":"IF(GORLIS!J70=\"\",\"\",+GORLIS!J70)","v":""},null,null,{"$f":"IF(GORLIS!M70=\"\",\"\",+GORLIS!M70)","v":""},null,{"$f":"IF(GORLIS!O70=\"\",\"\",+GORLIS!O70)","v":""},{"$f":"IF(GORLIS!P70=\"\",\"\",+GORLIS!P70)","v":""},{"$f":"IF(GORLIS!Q70=\"\",\"\",+GORLIS!Q70)","v":""},{"$f":"IF(GORLIS!R70=\"\",\"\",+GORLIS!R70)","v":""},{"$f":"IF(J69=\"\",\"\",CONCATENATE(GORLIS!T70,\"--\",J69))","v":""},null,null,0,null,0,null,{"$f":"IF(GORLIS!S70=\"\",\"\",+GORLIS!S70)","v":""}]
[null,{"$f":"IF(GORLIS!B71=\"\",\"\",B69+1)","v":""},{"$f":"IF(GORLIS!B71=\"\",\"\",+GORLIS!B71)","v":""},{"$f":"IF(GORLIS!C71=\"\",\"\",+GORLIS!C71)","v":""},{"$f":"IF(GORLIS!D71=\"\",\"\",+GORLIS!D71)","v":""},{"$f":"IF(GORLIS!E71=\"\",\"\",+GORLIS!E71)","v":""},{"$f":"IF(GORLIS!F71=\"\",\"\",+GORLIS!F71)","v":""},{"$f":"IF(GORLIS!G71=\"\",\"\",+GORLIS!G71)","v":""},{"$f":"IF(GORLIS!H71=\"\",\"\",+GORLIS!H71)","v":""},{"$f":"IF(GORLIS!I71=\"\",\"\",+GORLIS!I71)","v":""},{"$f":"IF(GORLIS!J71=\"\",\"\",+GORLIS!J71)","v":""},null,null,{"$f":"IF(GORLIS!M71=\"\",\"\",+GORLIS!M71)","v":""},null,{"$f":"IF(GORLIS!O71=\"\",\"\",+GORLIS!O71)","v":""},{"$f":"IF(GORLIS!P71=\"\",\"\",+GORLIS!P71)","v":""},{"$f":"IF(GORLIS!Q71=\"\",\"\",+GORLIS!Q71)","v":""},{"$f":"IF(GORLIS!R71=\"\",\"\",+GORLIS!R71)","v":""},{"$f":"IF(J70=\"\",\"\",CONCATENATE(GORLIS!T71,\"--\",J70))","v":""},null,null,0,null,0,null,{"$f":"IF(GORLIS!S71=\"\",\"\",+GORLIS!S71)","v":""}]
[null,{"$f":"IF(GORLIS!B72=\"\",\"\",B70+1)","v":""},{"$f":"IF(GORLIS!B72=\"\",\"\",+GORLIS!B72)","v":""},{"$f":"IF(GORLIS!C72=\"\",\"\",+GORLIS!C72)","v":""},{"$f":"IF(GORLIS!D72=\"\",\"\",+GORLIS!D72)","v":""},{"$f":"IF(GORLIS!E72=\"\",\"\",+GORLIS!E72)","v":""},{"$f":"IF(GORLIS!F72=\"\",\"\",+GORLIS!F72)","v":""},{"$f":"IF(GORLIS!G72=\"\",\"\",+GORLIS!G72)","v":""},{"$f":"IF(GORLIS!H72=\"\",\"\",+GORLIS!H72)","v":""},{"$f":"IF(GORLIS!I72=\"\",\"\",+GORLIS!I72)","v":""},{"$f":"IF(GORLIS!J72=\"\",\"\",+GORLIS!J72)","v":""},null,null,{"$f":"IF(GORLIS!M72=\"\",\"\",+GORLIS!M72)","v":""},null,{"$f":"IF(GORLIS!O72=\"\",\"\",+GORLIS!O72)","v":""},{"$f":"IF(GORLIS!P72=\"\",\"\",+GORLIS!P72)","v":""},{"$f":"IF(GORLIS!Q72=\"\",\"\",+GORLIS!Q72)","v":""},{"$f":"IF(GORLIS!R72=\"\",\"\",+GORLIS!R72)","v":""},{"$f":"IF(J71=\"\",\"\",CONCATENATE(GORLIS!T72,\"--\",J71))","v":""},null,null,0,null,0,null,{"$f":"IF(GORLIS!S72=\"\",\"\",+GORLIS!S72)","v":""}]
[null,{"$f":"IF(GORLIS!B73=\"\",\"\",B71+1)","v":""},{"$f":"IF(GORLIS!B73=\"\",\"\",+GORLIS!B73)","v":""},{"$f":"IF(GORLIS!C73=\"\",\"\",+GORLIS!C73)","v":""},{"$f":"IF(GORLIS!D73=\"\",\"\",+GORLIS!D73)","v":""},{"$f":"IF(GORLIS!E73=\"\",\"\",+GORLIS!E73)","v":""},{"$f":"IF(GORLIS!F73=\"\",\"\",+GORLIS!F73)","v":""},{"$f":"IF(GORLIS!G73=\"\",\"\",+GORLIS!G73)","v":""},{"$f":"IF(GORLIS!H73=\"\",\"\",+GORLIS!H73)","v":""},{"$f":"IF(GORLIS!I73=\"\",\"\",+GORLIS!I73)","v":""},{"$f":"IF(GORLIS!J73=\"\",\"\",+GORLIS!J73)","v":""},null,null,{"$f":"IF(GORLIS!M73=\"\",\"\",+GORLIS!M73)","v":""},null,{"$f":"IF(GORLIS!O73=\"\",\"\",+GORLIS!O73)","v":""},{"$f":"IF(GORLIS!P73=\"\",\"\",+GORLIS!P73)","v":""},{"$f":"IF(GORLIS!Q73=\"\",\"\",+GORLIS!Q73)","v":""},{"$f":"IF(GORLIS!R73=\"\",\"\",+GORLIS!R73)","v":""},{"$f":"IF(J72=\"\",\"\",CONCATENATE(GORLIS!T73,\"--\",J72))","v":""},null,null,0,null,0,null,{"$f":"IF(GORLIS!S73=\"\",\"\",+GORLIS!S73)","v":""}]
[null,{"$f":"IF(GORLIS!B74=\"\",\"\",B72+1)","v":""},{"$f":"IF(GORLIS!B74=\"\",\"\",+GORLIS!B74)","v":""},{"$f":"IF(GORLIS!C74=\"\",\"\",+GORLIS!C74)","v":""},{"$f":"IF(GORLIS!D74=\"\",\"\",+GORLIS!D74)","v":""},{"$f":"IF(GORLIS!E74=\"\",\"\",+GORLIS!E74)","v":""},{"$f":"IF(GORLIS!F74=\"\",\"\",+GORLIS!F74)","v":""},{"$f":"IF(GORLIS!G74=\"\",\"\",+GORLIS!G74)","v":""},{"$f":"IF(GORLIS!H74=\"\",\"\",+GORLIS!H74)","v":""},{"$f":"IF(GORLIS!I74=\"\",\"\",+GORLIS!I74)","v":""},{"$f":"IF(GORLIS!J74=\"\",\"\",+GORLIS!J74)","v":""},null,null,{"$f":"IF(GORLIS!M74=\"\",\"\",+GORLIS!M74)","v":""},null,{"$f":"IF(GORLIS!O74=\"\",\"\",+GORLIS!O74)","v":""},{"$f":"IF(GORLIS!P74=\"\",\"\",+GORLIS!P74)","v":""},{"$f":"IF(GORLIS!Q74=\"\",\"\",+GORLIS!Q74)","v":""},{"$f":"IF(GORLIS!R74=\"\",\"\",+GORLIS!R74)","v":""},{"$f":"IF(J73=\"\",\"\",CONCATENATE(GORLIS!T74,\"--\",J73))","v":""},null,null,0,null,0,null,{"$f":"IF(GORLIS!S74=\"\",\"\",+GORLIS!S74)","v":""}]
[null,{"$f":"IF(GORLIS!B75=\"\",\"\",B73+1)","v":""},{"$f":"IF(GORLIS!B75=\"\",\"\",+GORLIS!B75)","v":""},{"$f":"IF(GORLIS!C75=\"\",\"\",+GORLIS!C75)","v":""},{"$f":"IF(GORLIS!D75=\"\",\"\",+GORLIS!D75)","v":""},{"$f":"IF(GORLIS!E75=\"\",\"\",+GORLIS!E75)","v":""},{"$f":"IF(GORLIS!F75=\"\",\"\",+GORLIS!F75)","v":""},{"$f":"IF(GORLIS!G75=\"\",\"\",+GORLIS!G75)","v":""},{"$f":"IF(GORLIS!H75=\"\",\"\",+GORLIS!H75)","v":""},{"$f":"IF(GORLIS!I75=\"\",\"\",+GORLIS!I75)","v":""},{"$f":"IF(GORLIS!J75=\"\",\"\",+GORLIS!J75)","v":""},null,null,{"$f":"IF(GORLIS!M75=\"\",\"\",+GORLIS!M75)","v":""},null,{"$f":"IF(GORLIS!O75=\"\",\"\",+GORLIS!O75)","v":""},{"$f":"IF(GORLIS!P75=\"\",\"\",+GORLIS!P75)","v":""},{"$f":"IF(GORLIS!Q75=\"\",\"\",+GORLIS!Q75)","v":""},{"$f":"IF(GORLIS!R75=\"\",\"\",+GORLIS!R75)","v":""},{"$f":"IF(J74=\"\",\"\",CONCATENATE(GORLIS!T75,\"--\",J74))","v":""},null,null,0,null,0,null,{"$f":"IF(GORLIS!S75=\"\",\"\",+GORLIS!S75)","v":""}]
[null,{"$f":"IF(GORLIS!B76=\"\",\"\",B74+1)","v":""},{"$f":"IF(GORLIS!B76=\"\",\"\",+GORLIS!B76)","v":""},{"$f":"IF(GORLIS!C76=\"\",\"\",+GORLIS!C76)","v":""},{"$f":"IF(GORLIS!D76=\"\",\"\",+GORLIS!D76)","v":""},{"$f":"IF(GORLIS!E76=\"\",\"\",+GORLIS!E76)","v":""},{"$f":"IF(GORLIS!F76=\"\",\"\",+GORLIS!F76)","v":""},{"$f":"IF(GORLIS!G76=\"\",\"\",+GORLIS!G76)","v":""},{"$f":"IF(GORLIS!H76=\"\",\"\",+GORLIS!H76)","v":""},{"$f":"IF(GORLIS!I76=\"\",\"\",+GORLIS!I76)","v":""},{"$f":"IF(GORLIS!J76=\"\",\"\",+GORLIS!J76)","v":""},null,null,{"$f":"IF(GORLIS!M76=\"\",\"\",+GORLIS!M76)","v":""},null,{"$f":"IF(GORLIS!O76=\"\",\"\",+GORLIS!O76)","v":""},{"$f":"IF(GORLIS!P76=\"\",\"\",+GORLIS!P76)","v":""},{"$f":"IF(GORLIS!Q76=\"\",\"\",+GORLIS!Q76)","v":""},{"$f":"IF(GORLIS!R76=\"\",\"\",+GORLIS!R76)","v":""},{"$f":"IF(J75=\"\",\"\",CONCATENATE(GORLIS!T76,\"--\",J75))","v":""},null,null,0,null,0,null,{"$f":"IF(GORLIS!S76=\"\",\"\",+GORLIS!S76)","v":""}]
[null,{"$f":"IF(GORLIS!B77=\"\",\"\",B75+1)","v":""},{"$f":"IF(GORLIS!B77=\"\",\"\",+GORLIS!B77)","v":""},{"$f":"IF(GORLIS!C77=\"\",\"\",+GORLIS!C77)","v":""},{"$f":"IF(GORLIS!D77=\"\",\"\",+GORLIS!D77)","v":""},{"$f":"IF(GORLIS!E77=\"\",\"\",+GORLIS!E77)","v":""},{"$f":"IF(GORLIS!F77=\"\",\"\",+GORLIS!F77)","v":""},{"$f":"IF(GORLIS!G77=\"\",\"\",+GORLIS!G77)","v":""},{"$f":"IF(GORLIS!H77=\"\",\"\",+GORLIS!H77)","v":""},{"$f":"IF(GORLIS!I77=\"\",\"\",+GORLIS!I77)","v":""},{"$f":"IF(GORLIS!J77=\"\",\"\",+GORLIS!J77)","v":""},null,null,{"$f":"IF(GORLIS!M77=\"\",\"\",+GORLIS!M77)","v":""},null,{"$f":"IF(GORLIS!O77=\"\",\"\",+GORLIS!O77)","v":""},{"$f":"IF(GORLIS!P77=\"\",\"\",+GORLIS!P77)","v":""},{"$f":"IF(GORLIS!Q77=\"\",\"\",+GORLIS!Q77)","v":""},{"$f":"IF(GORLIS!R77=\"\",\"\",+GORLIS!R77)","v":""},{"$f":"IF(J76=\"\",\"\",CONCATENATE(GORLIS!T77,\"--\",J76))","v":""},null,null,0,null,0,null,{"$f":"IF(GORLIS!S77=\"\",\"\",+GORLIS!S77)","v":""}]
[null,{"$f":"IF(GORLIS!B78=\"\",\"\",B76+1)","v":""},{"$f":"IF(GORLIS!B78=\"\",\"\",+GORLIS!B78)","v":""},{"$f":"IF(GORLIS!C78=\"\",\"\",+GORLIS!C78)","v":""},{"$f":"IF(GORLIS!D78=\"\",\"\",+GORLIS!D78)","v":""},{"$f":"IF(GORLIS!E78=\"\",\"\",+GORLIS!E78)","v":""},{"$f":"IF(GORLIS!F78=\"\",\"\",+GORLIS!F78)","v":""},{"$f":"IF(GORLIS!G78=\"\",\"\",+GORLIS!G78)","v":""},{"$f":"IF(GORLIS!H78=\"\",\"\",+GORLIS!H78)","v":""},{"$f":"IF(GORLIS!I78=\"\",\"\",+GORLIS!I78)","v":""},{"$f":"IF(GORLIS!J78=\"\",\"\",+GORLIS!J78)","v":""},null,null,{"$f":"IF(GORLIS!M78=\"\",\"\",+GORLIS!M78)","v":""},null,{"$f":"IF(GORLIS!O78=\"\",\"\",+GORLIS!O78)","v":""},{"$f":"IF(GORLIS!P78=\"\",\"\",+GORLIS!P78)","v":""},{"$f":"IF(GORLIS!Q78=\"\",\"\",+GORLIS!Q78)","v":""},{"$f":"IF(GORLIS!R78=\"\",\"\",+GORLIS!R78)","v":""},{"$f":"IF(J77=\"\",\"\",CONCATENATE(GORLIS!T78,\"--\",J77))","v":""},null,null,0,null,0,null,{"$f":"IF(GORLIS!S78=\"\",\"\",+GORLIS!S78)","v":""}]
[null,{"$f":"IF(GORLIS!B79=\"\",\"\",B77+1)","v":""},{"$f":"IF(GORLIS!B79=\"\",\"\",+GORLIS!B79)","v":""},{"$f":"IF(GORLIS!C79=\"\",\"\",+GORLIS!C79)","v":""},{"$f":"IF(GORLIS!D79=\"\",\"\",+GORLIS!D79)","v":""},{"$f":"IF(GORLIS!E79=\"\",\"\",+GORLIS!E79)","v":""},{"$f":"IF(GORLIS!F79=\"\",\"\",+GORLIS!F79)","v":""},{"$f":"IF(GORLIS!G79=\"\",\"\",+GORLIS!G79)","v":""},{"$f":"IF(GORLIS!H79=\"\",\"\",+GORLIS!H79)","v":""},{"$f":"IF(GORLIS!I79=\"\",\"\",+GORLIS!I79)","v":""},{"$f":"IF(GORLIS!J79=\"\",\"\",+GORLIS!J79)","v":""},null,null,{"$f":"IF(GORLIS!M79=\"\",\"\",+GORLIS!M79)","v":""},null,{"$f":"IF(GORLIS!O79=\"\",\"\",+GORLIS!O79)","v":""},{"$f":"IF(GORLIS!P79=\"\",\"\",+GORLIS!P79)","v":""},{"$f":"IF(GORLIS!Q79=\"\",\"\",+GORLIS!Q79)","v":""},{"$f":"IF(GORLIS!R79=\"\",\"\",+GORLIS!R79)","v":""},{"$f":"IF(J78=\"\",\"\",CONCATENATE(GORLIS!T79,\"--\",J78))","v":""},null,null,0,null,0,null,{"$f":"IF(GORLIS!S79=\"\",\"\",+GORLIS!S79)","v":""}]
[null,{"$f":"IF(GORLIS!B80=\"\",\"\",B78+1)","v":""},{"$f":"IF(GORLIS!B80=\"\",\"\",+GORLIS!B80)","v":""},{"$f":"IF(GORLIS!C80=\"\",\"\",+GORLIS!C80)","v":""},{"$f":"IF(GORLIS!D80=\"\",\"\",+GORLIS!D80)","v":""},{"$f":"IF(GORLIS!E80=\"\",\"\",+GORLIS!E80)","v":""},{"$f":"IF(GORLIS!F80=\"\",\"\",+GORLIS!F80)","v":""},{"$f":"IF(GORLIS!G80=\"\",\"\",+GORLIS!G80)","v":""},{"$f":"IF(GORLIS!H80=\"\",\"\",+GORLIS!H80)","v":""},{"$f":"IF(GORLIS!I80=\"\",\"\",+GORLIS!I80)","v":""},{"$f":"IF(GORLIS!J80=\"\",\"\",+GORLIS!J80)","v":""},null,null,{"$f":"IF(GORLIS!M80=\"\",\"\",+GORLIS!M80)","v":""},null,{"$f":"IF(GORLIS!O80=\"\",\"\",+GORLIS!O80)","v":""},{"$f":"IF(GORLIS!P80=\"\",\"\",+GORLIS!P80)","v":""},{"$f":"IF(GORLIS!Q80=\"\",\"\",+GORLIS!Q80)","v":""},{"$f":"IF(GORLIS!R80=\"\",\"\",+GORLIS!R80)","v":""},{"$f":"IF(J79=\"\",\"\",CONCATENATE(GORLIS!T80,\"--\",J79))","v":""},null,null,0,null,0,null,{"$f":"IF(GORLIS!S80=\"\",\"\",+GORLIS!S80)","v":""}]
[null,{"$f":"IF(GORLIS!B81=\"\",\"\",B79+1)","v":""},{"$f":"IF(GORLIS!B81=\"\",\"\",+GORLIS!B81)","v":""},{"$f":"IF(GORLIS!C81=\"\",\"\",+GORLIS!C81)","v":""},{"$f":"IF(GORLIS!D81=\"\",\"\",+GORLIS!D81)","v":""},{"$f":"IF(GORLIS!E81=\"\",\"\",+GORLIS!E81)","v":""},{"$f":"IF(GORLIS!F81=\"\",\"\",+GORLIS!F81)","v":""},{"$f":"IF(GORLIS!G81=\"\",\"\",+GORLIS!G81)","v":""},{"$f":"IF(GORLIS!H81=\"\",\"\",+GORLIS!H81)","v":""},{"$f":"IF(GORLIS!I81=\"\",\"\",+GORLIS!I81)","v":""},{"$f":"IF(GORLIS!J81=\"\",\"\",+GORLIS!J81)","v":""},null,null,{"$f":"IF(GORLIS!M81=\"\",\"\",+GORLIS!M81)","v":""},null,{"$f":"IF(GORLIS!O81=\"\",\"\",+GORLIS!O81)","v":""},{"$f":"IF(GORLIS!P81=\"\",\"\",+GORLIS!P81)","v":""},{"$f":"IF(GORLIS!Q81=\"\",\"\",+GORLIS!Q81)","v":""},{"$f":"IF(GORLIS!R81=\"\",\"\",+GORLIS!R81)","v":""},{"$f":"IF(J80=\"\",\"\",CONCATENATE(GORLIS!T81,\"--\",J80))","v":""},null,null,0,null,0,null,{"$f":"IF(GORLIS!S81=\"\",\"\",+GORLIS!S81)","v":""}]
[null,{"$f":"IF(GORLIS!B82=\"\",\"\",B80+1)","v":""},{"$f":"IF(GORLIS!B82=\"\",\"\",+GORLIS!B82)","v":""},{"$f":"IF(GORLIS!C82=\"\",\"\",+GORLIS!C82)","v":""},{"$f":"IF(GORLIS!D82=\"\",\"\",+GORLIS!D82)","v":""},{"$f":"IF(GORLIS!E82=\"\",\"\",+GORLIS!E82)","v":""},{"$f":"IF(GORLIS!F82=\"\",\"\",+GORLIS!F82)","v":""},{"$f":"IF(GORLIS!G82=\"\",\"\",+GORLIS!G82)","v":""},{"$f":"IF(GORLIS!H82=\"\",\"\",+GORLIS!H82)","v":""},{"$f":"IF(GORLIS!I82=\"\",\"\",+GORLIS!I82)","v":""},{"$f":"IF(GORLIS!J82=\"\",\"\",+GORLIS!J82)","v":""},null,null,{"$f":"IF(GORLIS!M82=\"\",\"\",+GORLIS!M82)","v":""},null,{"$f":"IF(GORLIS!O82=\"\",\"\",+GORLIS!O82)","v":""},{"$f":"IF(GORLIS!P82=\"\",\"\",+GORLIS!P82)","v":""},{"$f":"IF(GORLIS!Q82=\"\",\"\",+GORLIS!Q82)","v":""},{"$f":"IF(GORLIS!R82=\"\",\"\",+GORLIS!R82)","v":""},{"$f":"IF(J81=\"\",\"\",CONCATENATE(GORLIS!T82,\"--\",J81))","v":""},null,null,0,null,0,null,{"$f":"IF(GORLIS!S82=\"\",\"\",+GORLIS!S82)","v":""}]
[null,{"$f":"IF(GORLIS!B83=\"\",\"\",B81+1)","v":""},{"$f":"IF(GORLIS!B83=\"\",\"\",+GORLIS!B83)","v":""},{"$f":"IF(GORLIS!C83=\"\",\"\",+GORLIS!C83)","v":""},{"$f":"IF(GORLIS!D83=\"\",\"\",+GORLIS!D83)","v":""},{"$f":"IF(GORLIS!E83=\"\",\"\",+GORLIS!E83)","v":""},{"$f":"IF(GORLIS!F83=\"\",\"\",+GORLIS!F83)","v":""},{"$f":"IF(GORLIS!G83=\"\",\"\",+GORLIS!G83)","v":""},{"$f":"IF(GORLIS!H83=\"\",\"\",+GORLIS!H83)","v":""},{"$f":"IF(GORLIS!I83=\"\",\"\",+GORLIS!I83)","v":""},{"$f":"IF(GORLIS!J83=\"\",\"\",+GORLIS!J83)","v":""},null,null,{"$f":"IF(GORLIS!M83=\"\",\"\",+GORLIS!M83)","v":""},null,{"$f":"IF(GORLIS!O83=\"\",\"\",+GORLIS!O83)","v":""},{"$f":"IF(GORLIS!P83=\"\",\"\",+GORLIS!P83)","v":""},{"$f":"IF(GORLIS!Q83=\"\",\"\",+GORLIS!Q83)","v":""},{"$f":"IF(GORLIS!R83=\"\",\"\",+GORLIS!R83)","v":""},{"$f":"IF(J82=\"\",\"\",CONCATENATE(GORLIS!T83,\"--\",J82))","v":""},null,null,0,null,0,null,{"$f":"IF(GORLIS!S83=\"\",\"\",+GORLIS!S83)","v":""}]
[null,{"$f":"IF(GORLIS!B84=\"\",\"\",B82+1)","v":""},{"$f":"IF(GORLIS!B84=\"\",\"\",+GORLIS!B84)","v":""},{"$f":"IF(GORLIS!C84=\"\",\"\",+GORLIS!C84)","v":""},{"$f":"IF(GORLIS!D84=\"\",\"\",+GORLIS!D84)","v":""},{"$f":"IF(GORLIS!E84=\"\",\"\",+GORLIS!E84)","v":""},{"$f":"IF(GORLIS!F84=\"\",\"\",+GORLIS!F84)","v":""},{"$f":"IF(GORLIS!G84=\"\",\"\",+GORLIS!G84)","v":""},{"$f":"IF(GORLIS!H84=\"\",\"\",+GORLIS!H84)","v":""},{"$f":"IF(GORLIS!I84=\"\",\"\",+GORLIS!I84)","v":""},{"$f":"IF(GORLIS!J84=\"\",\"\",+GORLIS!J84)","v":""},null,null,{"$f":"IF(GORLIS!M84=\"\",\"\",+GORLIS!M84)","v":""},null,{"$f":"IF(GORLIS!O84=\"\",\"\",+GORLIS!O84)","v":""},{"$f":"IF(GORLIS!P84=\"\",\"\",+GORLIS!P84)","v":""},{"$f":"IF(GORLIS!Q84=\"\",\"\",+GORLIS!Q84)","v":""},{"$f":"IF(GORLIS!R84=\"\",\"\",+GORLIS!R84)","v":""},{"$f":"IF(J83=\"\",\"\",CONCATENATE(GORLIS!T84,\"--\",J83))","v":""},null,null,0,null,0,null,{"$f":"IF(GORLIS!S84=\"\",\"\",+GORLIS!S84)","v":""}]
[null,{"$f":"IF(GORLIS!B85=\"\",\"\",B83+1)","v":""},{"$f":"IF(GORLIS!B85=\"\",\"\",+GORLIS!B85)","v":""},{"$f":"IF(GORLIS!C85=\"\",\"\",+GORLIS!C85)","v":""},{"$f":"IF(GORLIS!D85=\"\",\"\",+GORLIS!D85)","v":""},{"$f":"IF(GORLIS!E85=\"\",\"\",+GORLIS!E85)","v":""},{"$f":"IF(GORLIS!F85=\"\",\"\",+GORLIS!F85)","v":""},{"$f":"IF(GORLIS!G85=\"\",\"\",+GORLIS!G85)","v":""},{"$f":"IF(GORLIS!H85=\"\",\"\",+GORLIS!H85)","v":""},{"$f":"IF(GORLIS!I85=\"\",\"\",+GORLIS!I85)","v":""},{"$f":"IF(GORLIS!J85=\"\",\"\",+GORLIS!J85)","v":""},null,null,{"$f":"IF(GORLIS!M85=\"\",\"\",+GORLIS!M85)","v":""},null,{"$f":"IF(GORLIS!O85=\"\",\"\",+GORLIS!O85)","v":""},{"$f":"IF(GORLIS!P85=\"\",\"\",+GORLIS!P85)","v":""},{"$f":"IF(GORLIS!Q85=\"\",\"\",+GORLIS!Q85)","v":""},{"$f":"IF(GORLIS!R85=\"\",\"\",+GORLIS!R85)","v":""},{"$f":"IF(J84=\"\",\"\",CONCATENATE(GORLIS!T85,\"--\",J84))","v":""},null,null,0,null,0,null,{"$f":"IF(GORLIS!S85=\"\",\"\",+GORLIS!S85)","v":""}]
[null,{"$f":"IF(GORLIS!B86=\"\",\"\",B84+1)","v":""},{"$f":"IF(GORLIS!B86=\"\",\"\",+GORLIS!B86)","v":""},{"$f":"IF(GORLIS!C86=\"\",\"\",+GORLIS!C86)","v":""},{"$f":"IF(GORLIS!D86=\"\",\"\",+GORLIS!D86)","v":""},{"$f":"IF(GORLIS!E86=\"\",\"\",+GORLIS!E86)","v":""},{"$f":"IF(GORLIS!F86=\"\",\"\",+GORLIS!F86)","v":""},{"$f":"IF(GORLIS!G86=\"\",\"\",+GORLIS!G86)","v":""},{"$f":"IF(GORLIS!H86=\"\",\"\",+GORLIS!H86)","v":""},{"$f":"IF(GORLIS!I86=\"\",\"\",+GORLIS!I86)","v":""},{"$f":"IF(GORLIS!J86=\"\",\"\",+GORLIS!J86)","v":""},null,null,{"$f":"IF(GORLIS!M86=\"\",\"\",+GORLIS!M86)","v":""},null,{"$f":"IF(GORLIS!O86=\"\",\"\",+GORLIS!O86)","v":""},{"$f":"IF(GORLIS!P86=\"\",\"\",+GORLIS!P86)","v":""},{"$f":"IF(GORLIS!Q86=\"\",\"\",+GORLIS!Q86)","v":""},{"$f":"IF(GORLIS!R86=\"\",\"\",+GORLIS!R86)","v":""},{"$f":"IF(J85=\"\",\"\",CONCATENATE(GORLIS!T86,\"--\",J85))","v":""},null,null,0,null,0,null,{"$f":"IF(GORLIS!S86=\"\",\"\",+GORLIS!S86)","v":""}]
[null,{"$f":"IF(GORLIS!B87=\"\",\"\",B85+1)","v":""},{"$f":"IF(GORLIS!B87=\"\",\"\",+GORLIS!B87)","v":""},{"$f":"IF(GORLIS!C87=\"\",\"\",+GORLIS!C87)","v":""},{"$f":"IF(GORLIS!D87=\"\",\"\",+GORLIS!D87)","v":""},{"$f":"IF(GORLIS!E87=\"\",\"\",+GORLIS!E87)","v":""},{"$f":"IF(GORLIS!F87=\"\",\"\",+GORLIS!F87)","v":""},{"$f":"IF(GORLIS!G87=\"\",\"\",+GORLIS!G87)","v":""},{"$f":"IF(GORLIS!H87=\"\",\"\",+GORLIS!H87)","v":""},{"$f":"IF(GORLIS!I87=\"\",\"\",+GORLIS!I87)","v":""},{"$f":"IF(GORLIS!J87=\"\",\"\",+GORLIS!J87)","v":""},null,null,{"$f":"IF(GORLIS!M87=\"\",\"\",+GORLIS!M87)","v":""},null,{"$f":"IF(GORLIS!O87=\"\",\"\",+GORLIS!O87)","v":""},{"$f":"IF(GORLIS!P87=\"\",\"\",+GORLIS!P87)","v":""},{"$f":"IF(GORLIS!Q87=\"\",\"\",+GORLIS!Q87)","v":""},{"$f":"IF(GORLIS!R87=\"\",\"\",+GORLIS!R87)","v":""},{"$f":"IF(J86=\"\",\"\",CONCATENATE(GORLIS!T87,\"--\",J86))","v":""},null,null,0,null,0,null,{"$f":"IF(GORLIS!S87=\"\",\"\",+GORLIS!S87)","v":""}]
[null,{"$f":"IF(GORLIS!B88=\"\",\"\",B86+1)","v":""},{"$f":"IF(GORLIS!B88=\"\",\"\",+GORLIS!B88)","v":""},{"$f":"IF(GORLIS!C88=\"\",\"\",+GORLIS!C88)","v":""},{"$f":"IF(GORLIS!D88=\"\",\"\",+GORLIS!D88)","v":""},{"$f":"IF(GORLIS!E88=\"\",\"\",+GORLIS!E88)","v":""},{"$f":"IF(GORLIS!F88=\"\",\"\",+GORLIS!F88)","v":""},{"$f":"IF(GORLIS!G88=\"\",\"\",+GORLIS!G88)","v":""},{"$f":"IF(GORLIS!H88=\"\",\"\",+GORLIS!H88)","v":""},{"$f":"IF(GORLIS!I88=\"\",\"\",+GORLIS!I88)","v":""},{"$f":"IF(GORLIS!J88=\"\",\"\",+GORLIS!J88)","v":""},null,null,{"$f":"IF(GORLIS!M88=\"\",\"\",+GORLIS!M88)","v":""},null,{"$f":"IF(GORLIS!O88=\"\",\"\",+GORLIS!O88)","v":""},{"$f":"IF(GORLIS!P88=\"\",\"\",+GORLIS!P88)","v":""},{"$f":"IF(GORLIS!Q88=\"\",\"\",+GORLIS!Q88)","v":""},{"$f":"IF(GORLIS!R88=\"\",\"\",+GORLIS!R88)","v":""},{"$f":"IF(J87=\"\",\"\",CONCATENATE(GORLIS!T88,\"--\",J87))","v":""},null,null,0,null,0,null,{"$f":"IF(GORLIS!S88=\"\",\"\",+GORLIS!S88)","v":""}]
[null,{"$f":"IF(GORLIS!B89=\"\",\"\",B87+1)","v":""},{"$f":"IF(GORLIS!B89=\"\",\"\",+GORLIS!B89)","v":""},{"$f":"IF(GORLIS!C89=\"\",\"\",+GORLIS!C89)","v":""},{"$f":"IF(GORLIS!D89=\"\",\"\",+GORLIS!D89)","v":""},{"$f":"IF(GORLIS!E89=\"\",\"\",+GORLIS!E89)","v":""},{"$f":"IF(GORLIS!F89=\"\",\"\",+GORLIS!F89)","v":""},{"$f":"IF(GORLIS!G89=\"\",\"\",+GORLIS!G89)","v":""},{"$f":"IF(GORLIS!H89=\"\",\"\",+GORLIS!H89)","v":""},{"$f":"IF(GORLIS!I89=\"\",\"\",+GORLIS!I89)","v":""},{"$f":"IF(GORLIS!J89=\"\",\"\",+GORLIS!J89)","v":""},null,null,{"$f":"IF(GORLIS!M89=\"\",\"\",+GORLIS!M89)","v":""},null,{"$f":"IF(GORLIS!O89=\"\",\"\",+GORLIS!O89)","v":""},{"$f":"IF(GORLIS!P89=\"\",\"\",+GORLIS!P89)","v":""},{"$f":"IF(GORLIS!Q89=\"\",\"\",+GORLIS!Q89)","v":""},{"$f":"IF(GORLIS!R89=\"\",\"\",+GORLIS!R89)","v":""},{"$f":"IF(J88=\"\",\"\",CONCATENATE(GORLIS!T89,\"--\",J88))","v":""},null,null,0,null,0,null,{"$f":"IF(GORLIS!S89=\"\",\"\",+GORLIS!S89)","v":""}]
[null,{"$f":"IF(GORLIS!B90=\"\",\"\",B88+1)","v":""},{"$f":"IF(GORLIS!B90=\"\",\"\",+GORLIS!B90)","v":""},{"$f":"IF(GORLIS!C90=\"\",\"\",+GORLIS!C90)","v":""},{"$f":"IF(GORLIS!D90=\"\",\"\",+GORLIS!D90)","v":""},{"$f":"IF(GORLIS!E90=\"\",\"\",+GORLIS!E90)","v":""},{"$f":"IF(GORLIS!F90=\"\",\"\",+GORLIS!F90)","v":""},{"$f":"IF(GORLIS!G90=\"\",\"\",+GORLIS!G90)","v":""},{"$f":"IF(GORLIS!H90=\"\",\"\",+GORLIS!H90)","v":""},{"$f":"IF(GORLIS!I90=\"\",\"\",+GORLIS!I90)","v":""},{"$f":"IF(GORLIS!J90=\"\",\"\",+GORLIS!J90)","v":""},null,null,{"$f":"IF(GORLIS!M90=\"\",\"\",+GORLIS!M90)","v":""},null,{"$f":"IF(GORLIS!O90=\"\",\"\",+GORLIS!O90)","v":""},{"$f":"IF(GORLIS!P90=\"\",\"\",+GORLIS!P90)","v":""},{"$f":"IF(GORLIS!Q90=\"\",\"\",+GORLIS!Q90)","v":""},{"$f":"IF(GORLIS!R90=\"\",\"\",+GORLIS!R90)","v":""},{"$f":"IF(J89=\"\",\"\",CONCATENATE(GORLIS!T90,\"--\",J89))","v":""},null,null,0,null,0,null,{"$f":"IF(GORLIS!S90=\"\",\"\",+GORLIS!S90)","v":""}]
[null,{"$f":"IF(GORLIS!B91=\"\",\"\",B89+1)","v":""},{"$f":"IF(GORLIS!B91=\"\",\"\",+GORLIS!B91)","v":""},{"$f":"IF(GORLIS!C91=\"\",\"\",+GORLIS!C91)","v":""},{"$f":"IF(GORLIS!D91=\"\",\"\",+GORLIS!D91)","v":""},{"$f":"IF(GORLIS!E91=\"\",\"\",+GORLIS!E91)","v":""},{"$f":"IF(GORLIS!F91=\"\",\"\",+GORLIS!F91)","v":""},{"$f":"IF(GORLIS!G91=\"\",\"\",+GORLIS!G91)","v":""},{"$f":"IF(GORLIS!H91=\"\",\"\",+GORLIS!H91)","v":""},{"$f":"IF(GORLIS!I91=\"\",\"\",+GORLIS!I91)","v":""},{"$f":"IF(GORLIS!J91=\"\",\"\",+GORLIS!J91)","v":""},null,null,{"$f":"IF(GORLIS!M91=\"\",\"\",+GORLIS!M91)","v":""},null,{"$f":"IF(GORLIS!O91=\"\",\"\",+GORLIS!O91)","v":""},{"$f":"IF(GORLIS!P91=\"\",\"\",+GORLIS!P91)","v":""},{"$f":"IF(GORLIS!Q91=\"\",\"\",+GORLIS!Q91)","v":""},{"$f":"IF(GORLIS!R91=\"\",\"\",+GORLIS!R91)","v":""},{"$f":"IF(J90=\"\",\"\",CONCATENATE(GORLIS!T91,\"--\",J90))","v":""},null,null,0,null,0,null,{"$f":"IF(GORLIS!S91=\"\",\"\",+GORLIS!S91)","v":""}]
[null,{"$f":"IF(GORLIS!B92=\"\",\"\",B90+1)","v":""},{"$f":"IF(GORLIS!B92=\"\",\"\",+GORLIS!B92)","v":""},{"$f":"IF(GORLIS!C92=\"\",\"\",+GORLIS!C92)","v":""},{"$f":"IF(GORLIS!D92=\"\",\"\",+GORLIS!D92)","v":""},{"$f":"IF(GORLIS!E92=\"\",\"\",+GORLIS!E92)","v":""},{"$f":"IF(GORLIS!F92=\"\",\"\",+GORLIS!F92)","v":""},{"$f":"IF(GORLIS!G92=\"\",\"\",+GORLIS!G92)","v":""},{"$f":"IF(GORLIS!H92=\"\",\"\",+GORLIS!H92)","v":""},{"$f":"IF(GORLIS!I92=\"\",\"\",+GORLIS!I92)","v":""},{"$f":"IF(GORLIS!J92=\"\",\"\",+GORLIS!J92)","v":""},null,null,{"$f":"IF(GORLIS!M92=\"\",\"\",+GORLIS!M92)","v":""},null,{"$f":"IF(GORLIS!O92=\"\",\"\",+GORLIS!O92)","v":""},{"$f":"IF(GORLIS!P92=\"\",\"\",+GORLIS!P92)","v":""},{"$f":"IF(GORLIS!Q92=\"\",\"\",+GORLIS!Q92)","v":""},{"$f":"IF(GORLIS!R92=\"\",\"\",+GORLIS!R92)","v":""},{"$f":"IF(J91=\"\",\"\",CONCATENATE(GORLIS!T92,\"--\",J91))","v":""},null,null,0,null,0,null,{"$f":"IF(GORLIS!S92=\"\",\"\",+GORLIS!S92)","v":""}]
[null,{"$f":"IF(GORLIS!B93=\"\",\"\",B91+1)","v":""},{"$f":"IF(GORLIS!B93=\"\",\"\",+GORLIS!B93)","v":""},{"$f":"IF(GORLIS!C93=\"\",\"\",+GORLIS!C93)","v":""},{"$f":"IF(GORLIS!D93=\"\",\"\",+GORLIS!D93)","v":""},{"$f":"IF(GORLIS!E93=\"\",\"\",+GORLIS!E93)","v":""},{"$f":"IF(GORLIS!F93=\"\",\"\",+GORLIS!F93)","v":""},{"$f":"IF(GORLIS!G93=\"\",\"\",+GORLIS!G93)","v":""},{"$f":"IF(GORLIS!H93=\"\",\"\",+GORLIS!H93)","v":""},{"$f":"IF(GORLIS!I93=\"\",\"\",+GORLIS!I93)","v":""},{"$f":"IF(GORLIS!J93=\"\",\"\",+GORLIS!J93)","v":""},null,null,{"$f":"IF(GORLIS!M93=\"\",\"\",+GORLIS!M93)","v":""},null,{"$f":"IF(GORLIS!O93=\"\",\"\",+GORLIS!O93)","v":""},{"$f":"IF(GORLIS!P93=\"\",\"\",+GORLIS!P93)","v":""},{"$f":"IF(GORLIS!Q93=\"\",\"\",+GORLIS!Q93)","v":""},{"$f":"IF(GORLIS!R93=\"\",\"\",+GORLIS!R93)","v":""},{"$f":"IF(J92=\"\",\"\",CONCATENATE(GORLIS!T93,\"--\",J92))","v":""},null,null,0,null,0,null,{"$f":"IF(GORLIS!S93=\"\",\"\",+GORLIS!S93)","v":""}]
[null,{"$f":"IF(GORLIS!B94=\"\",\"\",B92+1)","v":""},{"$f":"IF(GORLIS!B94=\"\",\"\",+GORLIS!B94)","v":""},{"$f":"IF(GORLIS!C94=\"\",\"\",+GORLIS!C94)","v":""},{"$f":"IF(GORLIS!D94=\"\",\"\",+GORLIS!D94)","v":""},{"$f":"IF(GORLIS!E94=\"\",\"\",+GORLIS!E94)","v":""},{"$f":"IF(GORLIS!F94=\"\",\"\",+GORLIS!F94)","v":""},{"$f":"IF(GORLIS!G94=\"\",\"\",+GORLIS!G94)","v":""},{"$f":"IF(GORLIS!H94=\"\",\"\",+GORLIS!H94)","v":""},{"$f":"IF(GORLIS!I94=\"\",\"\",+GORLIS!I94)","v":""},{"$f":"IF(GORLIS!J94=\"\",\"\",+GORLIS!J94)","v":""},null,null,{"$f":"IF(GORLIS!M94=\"\",\"\",+GORLIS!M94)","v":""},null,{"$f":"IF(GORLIS!O94=\"\",\"\",+GORLIS!O94)","v":""},{"$f":"IF(GORLIS!P94=\"\",\"\",+GORLIS!P94)","v":""},{"$f":"IF(GORLIS!Q94=\"\",\"\",+GORLIS!Q94)","v":""},{"$f":"IF(GORLIS!R94=\"\",\"\",+GORLIS!R94)","v":""},{"$f":"IF(J93=\"\",\"\",CONCATENATE(GORLIS!T94,\"--\",J93))","v":""},null,null,0,null,0,null,{"$f":"IF(GORLIS!S94=\"\",\"\",+GORLIS!S94)","v":""}]
[null,{"$f":"IF(GORLIS!B95=\"\",\"\",B93+1)","v":""},{"$f":"IF(GORLIS!B95=\"\",\"\",+GORLIS!B95)","v":""},{"$f":"IF(GORLIS!C95=\"\",\"\",+GORLIS!C95)","v":""},{"$f":"IF(GORLIS!D95=\"\",\"\",+GORLIS!D95)","v":""},{"$f":"IF(GORLIS!E95=\"\",\"\",+GORLIS!E95)","v":""},{"$f":"IF(GORLIS!F95=\"\",\"\",+GORLIS!F95)","v":""},{"$f":"IF(GORLIS!G95=\"\",\"\",+GORLIS!G95)","v":""},{"$f":"IF(GORLIS!H95=\"\",\"\",+GORLIS!H95)","v":""},{"$f":"IF(GORLIS!I95=\"\",\"\",+GORLIS!I95)","v":""},{"$f":"IF(GORLIS!J95=\"\",\"\",+GORLIS!J95)","v":""},null,null,{"$f":"IF(GORLIS!M95=\"\",\"\",+GORLIS!M95)","v":""},null,{"$f":"IF(GORLIS!O95=\"\",\"\",+GORLIS!O95)","v":""},{"$f":"IF(GORLIS!P95=\"\",\"\",+GORLIS!P95)","v":""},{"$f":"IF(GORLIS!Q95=\"\",\"\",+GORLIS!Q95)","v":""},{"$f":"IF(GORLIS!R95=\"\",\"\",+GORLIS!R95)","v":""},{"$f":"IF(J94=\"\",\"\",CONCATENATE(GORLIS!T95,\"--\",J94))","v":""},null,null,0,null,0,null,{"$f":"IF(GORLIS!S95=\"\",\"\",+GORLIS!S95)","v":""}]
[null,{"$f":"IF(GORLIS!B96=\"\",\"\",B94+1)","v":""},{"$f":"IF(GORLIS!B96=\"\",\"\",+GORLIS!B96)","v":""},{"$f":"IF(GORLIS!C96=\"\",\"\",+GORLIS!C96)","v":""},{"$f":"IF(GORLIS!D96=\"\",\"\",+GORLIS!D96)","v":""},{"$f":"IF(GORLIS!E96=\"\",\"\",+GORLIS!E96)","v":""},{"$f":"IF(GORLIS!F96=\"\",\"\",+GORLIS!F96)","v":""},{"$f":"IF(GORLIS!G96=\"\",\"\",+GORLIS!G96)","v":""},{"$f":"IF(GORLIS!H96=\"\",\"\",+GORLIS!H96)","v":""},{"$f":"IF(GORLIS!I96=\"\",\"\",+GORLIS!I96)","v":""},{"$f":"IF(GORLIS!J96=\"\",\"\",+GORLIS!J96)","v":""},null,null,{"$f":"IF(GORLIS!M96=\"\",\"\",+GORLIS!M96)","v":""},null,{"$f":"IF(GORLIS!O96=\"\",\"\",+GORLIS!O96)","v":""},{"$f":"IF(GORLIS!P96=\"\",\"\",+GORLIS!P96)","v":""},{"$f":"IF(GORLIS!Q96=\"\",\"\",+GORLIS!Q96)","v":""},{"$f":"IF(GORLIS!R96=\"\",\"\",+GORLIS!R96)","v":""},{"$f":"IF(J95=\"\",\"\",CONCATENATE(GORLIS!T96,\"--\",J95))","v":""},null,null,0,null,0,null,{"$f":"IF(GORLIS!S96=\"\",\"\",+GORLIS!S96)","v":""}]
[null,{"$f":"IF(GORLIS!B97=\"\",\"\",B95+1)","v":""},{"$f":"IF(GORLIS!B97=\"\",\"\",+GORLIS!B97)","v":""},{"$f":"IF(GORLIS!C97=\"\",\"\",+GORLIS!C97)","v":""},{"$f":"IF(GORLIS!D97=\"\",\"\",+GORLIS!D97)","v":""},{"$f":"IF(GORLIS!E97=\"\",\"\",+GORLIS!E97)","v":""},{"$f":"IF(GORLIS!F97=\"\",\"\",+GORLIS!F97)","v":""},{"$f":"IF(GORLIS!G97=\"\",\"\",+GORLIS!G97)","v":""},{"$f":"IF(GORLIS!H97=\"\",\"\",+GORLIS!H97)","v":""},{"$f":"IF(GORLIS!I97=\"\",\"\",+GORLIS!I97)","v":""},{"$f":"IF(GORLIS!J97=\"\",\"\",+GORLIS!J97)","v":""},null,null,{"$f":"IF(GORLIS!M97=\"\",\"\",+GORLIS!M97)","v":""},null,{"$f":"IF(GORLIS!O97=\"\",\"\",+GORLIS!O97)","v":""},{"$f":"IF(GORLIS!P97=\"\",\"\",+GORLIS!P97)","v":""},{"$f":"IF(GORLIS!Q97=\"\",\"\",+GORLIS!Q97)","v":""},{"$f":"IF(GORLIS!R97=\"\",\"\",+GORLIS!R97)","v":""},{"$f":"IF(J96=\"\",\"\",CONCATENATE(GORLIS!T97,\"--\",J96))","v":""},null,null,0,null,0,null,{"$f":"IF(GORLIS!S97=\"\",\"\",+GORLIS!S97)","v":""}]
[null,{"$f":"IF(GORLIS!B98=\"\",\"\",B96+1)","v":""},{"$f":"IF(GORLIS!B98=\"\",\"\",+GORLIS!B98)","v":""},{"$f":"IF(GORLIS!C98=\"\",\"\",+GORLIS!C98)","v":""},{"$f":"IF(GORLIS!D98=\"\",\"\",+GORLIS!D98)","v":""},{"$f":"IF(GORLIS!E98=\"\",\"\",+GORLIS!E98)","v":""},{"$f":"IF(GORLIS!F98=\"\",\"\",+GORLIS!F98)","v":""},{"$f":"IF(GORLIS!G98=\"\",\"\",+GORLIS!G98)","v":""},{"$f":"IF(GORLIS!H98=\"\",\"\",+GORLIS!H98)","v":""},{"$f":"IF(GORLIS!I98=\"\",\"\",+GORLIS!I98)","v":""},{"$f":"IF(GORLIS!J98=\"\",\"\",+GORLIS!J98)","v":""},null,null,{"$f":"IF(GORLIS!M98=\"\",\"\",+GORLIS!M98)","v":""},null,{"$f":"IF(GORLIS!O98=\"\",\"\",+GORLIS!O98)","v":""},{"$f":"IF(GORLIS!P98=\"\",\"\",+GORLIS!P98)","v":""},{"$f":"IF(GORLIS!Q98=\"\",\"\",+GORLIS!Q98)","v":""},{"$f":"IF(GORLIS!R98=\"\",\"\",+GORLIS!R98)","v":""},{"$f":"IF(J97=\"\",\"\",CONCATENATE(GORLIS!T98,\"--\",J97))","v":""},null,null,0,null,0,null,{"$f":"IF(GORLIS!S98=\"\",\"\",+GORLIS!S98)","v":""}]
[null,{"$f":"IF(GORLIS!B99=\"\",\"\",B97+1)","v":""},{"$f":"IF(GORLIS!B99=\"\",\"\",+GORLIS!B99)","v":""},{"$f":"IF(GORLIS!C99=\"\",\"\",+GORLIS!C99)","v":""},{"$f":"IF(GORLIS!D99=\"\",\"\",+GORLIS!D99)","v":""},{"$f":"IF(GORLIS!E99=\"\",\"\",+GORLIS!E99)","v":""},{"$f":"IF(GORLIS!F99=\"\",\"\",+GORLIS!F99)","v":""},{"$f":"IF(GORLIS!G99=\"\",\"\",+GORLIS!G99)","v":""},{"$f":"IF(GORLIS!H99=\"\",\"\",+GORLIS!H99)","v":""},{"$f":"IF(GORLIS!I99=\"\",\"\",+GORLIS!I99)","v":""},{"$f":"IF(GORLIS!J99=\"\",\"\",+GORLIS!J99)","v":""},null,null,{"$f":"IF(GORLIS!M99=\"\",\"\",+GORLIS!M99)","v":""},null,{"$f":"IF(GORLIS!O99=\"\",\"\",+GORLIS!O99)","v":""},{"$f":"IF(GORLIS!P99=\"\",\"\",+GORLIS!P99)","v":""},{"$f":"IF(GORLIS!Q99=\"\",\"\",+GORLIS!Q99)","v":""},{"$f":"IF(GORLIS!R99=\"\",\"\",+GORLIS!R99)","v":""},{"$f":"IF(J98=\"\",\"\",CONCATENATE(GORLIS!T99,\"--\",J98))","v":""},null,null,0,null,0,null,{"$f":"IF(GORLIS!S99=\"\",\"\",+GORLIS!S99)","v":""}]
[null,{"$f":"IF(GORLIS!B100=\"\",\"\",B98+1)","v":""},{"$f":"IF(GORLIS!B100=\"\",\"\",+GORLIS!B100)","v":""},{"$f":"IF(GORLIS!C100=\"\",\"\",+GORLIS!C100)","v":""},{"$f":"IF(GORLIS!D100=\"\",\"\",+GORLIS!D100)","v":""},{"$f":"IF(GORLIS!E100=\"\",\"\",+GORLIS!E100)","v":""},{"$f":"IF(GORLIS!F100=\"\",\"\",+GORLIS!F100)","v":""},{"$f":"IF(GORLIS!G100=\"\",\"\",+GORLIS!G100)","v":""},{"$f":"IF(GORLIS!H100=\"\",\"\",+GORLIS!H100)","v":""},{"$f":"IF(GORLIS!I100=\"\",\"\",+GORLIS!I100)","v":""},{"$f":"IF(GORLIS!J100=\"\",\"\",+GORLIS!J100)","v":""},null,null,{"$f":"IF(GORLIS!M100=\"\",\"\",+GORLIS!M100)","v":""},null,{"$f":"IF(GORLIS!O100=\"\",\"\",+GORLIS!O100)","v":""},{"$f":"IF(GORLIS!P100=\"\",\"\",+GORLIS!P100)","v":""},{"$f":"IF(GORLIS!Q100=\"\",\"\",+GORLIS!Q100)","v":""},{"$f":"IF(GORLIS!R100=\"\",\"\",+GORLIS!R100)","v":""},{"$f":"IF(J99=\"\",\"\",CONCATENATE(GORLIS!T100,\"--\",J99))","v":""},null,null,0,null,0,null,{"$f":"IF(GORLIS!S100=\"\",\"\",+GORLIS!S100)","v":""}]
[null,{"$f":"IF(GORLIS!B101=\"\",\"\",B99+1)","v":""},{"$f":"IF(GORLIS!B101=\"\",\"\",+GORLIS!B101)","v":""},{"$f":"IF(GORLIS!C101=\"\",\"\",+GORLIS!C101)","v":""},{"$f":"IF(GORLIS!D101=\"\",\"\",+GORLIS!D101)","v":""},{"$f":"IF(GORLIS!E101=\"\",\"\",+GORLIS!E101)","v":""},{"$f":"IF(GORLIS!F101=\"\",\"\",+GORLIS!F101)","v":""},{"$f":"IF(GORLIS!G101=\"\",\"\",+GORLIS!G101)","v":""},{"$f":"IF(GORLIS!H101=\"\",\"\",+GORLIS!H101)","v":""},{"$f":"IF(GORLIS!I101=\"\",\"\",+GORLIS!I101)","v":""},{"$f":"IF(GORLIS!J101=\"\",\"\",+GORLIS!J101)","v":""},null,null,{"$f":"IF(GORLIS!M101=\"\",\"\",+GORLIS!M101)","v":""},null,{"$f":"IF(GORLIS!O101=\"\",\"\",+GORLIS!O101)","v":""},{"$f":"IF(GORLIS!P101=\"\",\"\",+GORLIS!P101)","v":""},{"$f":"IF(GORLIS!Q101=\"\",\"\",+GORLIS!Q101)","v":""},{"$f":"IF(GORLIS!R101=\"\",\"\",+GORLIS!R101)","v":""},{"$f":"IF(J100=\"\",\"\",CONCATENATE(GORLIS!T101,\"--\",J100))","v":""},null,null,0,null,0,null,{"$f":"IF(GORLIS!S101=\"\",\"\",+GORLIS!S101)","v":""}]
[null,{"$f":"IF(GORLIS!B102=\"\",\"\",B100+1)","v":""},{"$f":"IF(GORLIS!B102=\"\",\"\",+GORLIS!B102)","v":""},{"$f":"IF(GORLIS!C102=\"\",\"\",+GORLIS!C102)","v":""},{"$f":"IF(GORLIS!D102=\"\",\"\",+GORLIS!D102)","v":""},{"$f":"IF(GORLIS!E102=\"\",\"\",+GORLIS!E102)","v":""},{"$f":"IF(GORLIS!F102=\"\",\"\",+GORLIS!F102)","v":""},{"$f":"IF(GORLIS!G102=\"\",\"\",+GORLIS!G102)","v":""},{"$f":"IF(GORLIS!H102=\"\",\"\",+GORLIS!H102)","v":""},{"$f":"IF(GORLIS!I102=\"\",\"\",+GORLIS!I102)","v":""},{"$f":"IF(GORLIS!J102=\"\",\"\",+GORLIS!J102)","v":""},null,null,{"$f":"IF(GORLIS!M102=\"\",\"\",+GORLIS!M102)","v":""},null,{"$f":"IF(GORLIS!O102=\"\",\"\",+GORLIS!O102)","v":""},{"$f":"IF(GORLIS!P102=\"\",\"\",+GORLIS!P102)","v":""},{"$f":"IF(GORLIS!Q102=\"\",\"\",+GORLIS!Q102)","v":""},{"$f":"IF(GORLIS!R102=\"\",\"\",+GORLIS!R102)","v":""},{"$f":"IF(J101=\"\",\"\",CONCATENATE(GORLIS!T102,\"--\",J101))","v":""},null,null,0,null,0,null,{"$f":"IF(GORLIS!S102=\"\",\"\",+GORLIS!S102)","v":""}]
[null,{"$f":"IF(GORLIS!B103=\"\",\"\",B101+1)","v":""},{"$f":"IF(GORLIS!B103=\"\",\"\",+GORLIS!B103)","v":""},{"$f":"IF(GORLIS!C103=\"\",\"\",+GORLIS!C103)","v":""},{"$f":"IF(GORLIS!D103=\"\",\"\",+GORLIS!D103)","v":""},{"$f":"IF(GORLIS!E103=\"\",\"\",+GORLIS!E103)","v":""},{"$f":"IF(GORLIS!F103=\"\",\"\",+GORLIS!F103)","v":""},{"$f":"IF(GORLIS!G103=\"\",\"\",+GORLIS!G103)","v":""},{"$f":"IF(GORLIS!H103=\"\",\"\",+GORLIS!H103)","v":""},{"$f":"IF(GORLIS!I103=\"\",\"\",+GORLIS!I103)","v":""},{"$f":"IF(GORLIS!J103=\"\",\"\",+GORLIS!J103)","v":""},null,null,{"$f":"IF(GORLIS!M103=\"\",\"\",+GORLIS!M103)","v":""},null,{"$f":"IF(GORLIS!O103=\"\",\"\",+GORLIS!O103)","v":""},{"$f":"IF(GORLIS!P103=\"\",\"\",+GORLIS!P103)","v":""},{"$f":"IF(GORLIS!Q103=\"\",\"\",+GORLIS!Q103)","v":""},{"$f":"IF(GORLIS!R103=\"\",\"\",+GORLIS!R103)","v":""},{"$f":"IF(J102=\"\",\"\",CONCATENATE(GORLIS!T103,\"--\",J102))","v":""},null,null,0,null,0,null,{"$f":"IF(GORLIS!S103=\"\",\"\",+GORLIS!S103)","v":""}]
[null,{"$f":"IF(GORLIS!B104=\"\",\"\",B102+1)","v":""},{"$f":"IF(GORLIS!B104=\"\",\"\",+GORLIS!B104)","v":""},{"$f":"IF(GORLIS!C104=\"\",\"\",+GORLIS!C104)","v":""},{"$f":"IF(GORLIS!D104=\"\",\"\",+GORLIS!D104)","v":""},{"$f":"IF(GORLIS!E104=\"\",\"\",+GORLIS!E104)","v":""},{"$f":"IF(GORLIS!F104=\"\",\"\",+GORLIS!F104)","v":""},{"$f":"IF(GORLIS!G104=\"\",\"\",+GORLIS!G104)","v":""},{"$f":"IF(GORLIS!H104=\"\",\"\",+GORLIS!H104)","v":""},{"$f":"IF(GORLIS!I104=\"\",\"\",+GORLIS!I104)","v":""},{"$f":"IF(GORLIS!J104=\"\",\"\",+GORLIS!J104)","v":""},null,null,{"$f":"IF(GORLIS!M104=\"\",\"\",+GORLIS!M104)","v":""},null,{"$f":"IF(GORLIS!O104=\"\",\"\",+GORLIS!O104)","v":""},{"$f":"IF(GORLIS!P104=\"\",\"\",+GORLIS!P104)","v":""},{"$f":"IF(GORLIS!Q104=\"\",\"\",+GORLIS!Q104)","v":""},{"$f":"IF(GORLIS!R104=\"\",\"\",+GORLIS!R104)","v":""},{"$f":"IF(J103=\"\",\"\",CONCATENATE(GORLIS!T104,\"--\",J103))","v":""},null,null,0,null,0,null,{"$f":"IF(GORLIS!S104=\"\",\"\",+GORLIS!S104)","v":""}]
[null,{"$f":"IF(GORLIS!B105=\"\",\"\",B103+1)","v":""},{"$f":"IF(GORLIS!B105=\"\",\"\",+GORLIS!B105)","v":""},{"$f":"IF(GORLIS!C105=\"\",\"\",+GORLIS!C105)","v":""},{"$f":"IF(GORLIS!D105=\"\",\"\",+GORLIS!D105)","v":""},{"$f":"IF(GORLIS!E105=\"\",\"\",+GORLIS!E105)","v":""},{"$f":"IF(GORLIS!F105=\"\",\"\",+GORLIS!F105)","v":""},{"$f":"IF(GORLIS!G105=\"\",\"\",+GORLIS!G105)","v":""},{"$f":"IF(GORLIS!H105=\"\",\"\",+GORLIS!H105)","v":""},{"$f":"IF(GORLIS!I105=\"\",\"\",+GORLIS!I105)","v":""},{"$f":"IF(GORLIS!J105=\"\",\"\",+GORLIS!J105)","v":""},null,null,{"$f":"IF(GORLIS!M105=\"\",\"\",+GORLIS!M105)","v":""},null,{"$f":"IF(GORLIS!O105=\"\",\"\",+GORLIS!O105)","v":""},{"$f":"IF(GORLIS!P105=\"\",\"\",+GORLIS!P105)","v":""},{"$f":"IF(GORLIS!Q105=\"\",\"\",+GORLIS!Q105)","v":""},{"$f":"IF(GORLIS!R105=\"\",\"\",+GORLIS!R105)","v":""},{"$f":"IF(J104=\"\",\"\",CONCATENATE(GORLIS!T105,\"--\",J104))","v":""},null,null,0,null,0,null,{"$f":"IF(GORLIS!S105=\"\",\"\",+GORLIS!S105)","v":""}]
[null,{"$f":"IF(GORLIS!B106=\"\",\"\",B104+1)","v":""},{"$f":"IF(GORLIS!B106=\"\",\"\",+GORLIS!B106)","v":""},{"$f":"IF(GORLIS!C106=\"\",\"\",+GORLIS!C106)","v":""},{"$f":"IF(GORLIS!D106=\"\",\"\",+GORLIS!D106)","v":""},{"$f":"IF(GORLIS!E106=\"\",\"\",+GORLIS!E106)","v":""},{"$f":"IF(GORLIS!F106=\"\",\"\",+GORLIS!F106)","v":""},{"$f":"IF(GORLIS!G106=\"\",\"\",+GORLIS!G106)","v":""},{"$f":"IF(GORLIS!H106=\"\",\"\",+GORLIS!H106)","v":""},{"$f":"IF(GORLIS!I106=\"\",\"\",+GORLIS!I106)","v":""},{"$f":"IF(GORLIS!J106=\"\",\"\",+GORLIS!J106)","v":""},null,null,{"$f":"IF(GORLIS!M106=\"\",\"\",+GORLIS!M106)","v":""},null,{"$f":"IF(GORLIS!O106=\"\",\"\",+GORLIS!O106)","v":""},{"$f":"IF(GORLIS!P106=\"\",\"\",+GORLIS!P106)","v":""},{"$f":"IF(GORLIS!Q106=\"\",\"\",+GORLIS!Q106)","v":""},{"$f":"IF(GORLIS!R106=\"\",\"\",+GORLIS!R106)","v":""},{"$f":"IF(J105=\"\",\"\",CONCATENATE(GORLIS!T106,\"--\",J105))","v":""},null,null,0,null,0,null,{"$f":"IF(GORLIS!S106=\"\",\"\",+GORLIS!S106)","v":""}]
[null,{"$f":"IF(GORLIS!B107=\"\",\"\",B105+1)","v":""},{"$f":"IF(GORLIS!B107=\"\",\"\",+GORLIS!B107)","v":""},{"$f":"IF(GORLIS!C107=\"\",\"\",+GORLIS!C107)","v":""},{"$f":"IF(GORLIS!D107=\"\",\"\",+GORLIS!D107)","v":""},{"$f":"IF(GORLIS!E107=\"\",\"\",+GORLIS!E107)","v":""},{"$f":"IF(GORLIS!F107=\"\",\"\",+GORLIS!F107)","v":""},{"$f":"IF(GORLIS!G107=\"\",\"\",+GORLIS!G107)","v":""},{"$f":"IF(GORLIS!H107=\"\",\"\",+GORLIS!H107)","v":""},{"$f":"IF(GORLIS!I107=\"\",\"\",+GORLIS!I107)","v":""},{"$f":"IF(GORLIS!J107=\"\",\"\",+GORLIS!J107)","v":""},null,null,{"$f":"IF(GORLIS!M107=\"\",\"\",+GORLIS!M107)","v":""},null,{"$f":"IF(GORLIS!O107=\"\",\"\",+GORLIS!O107)","v":""},{"$f":"IF(GORLIS!P107=\"\",\"\",+GORLIS!P107)","v":""},{"$f":"IF(GORLIS!Q107=\"\",\"\",+GORLIS!Q107)","v":""},{"$f":"IF(GORLIS!R107=\"\",\"\",+GORLIS!R107)","v":""},{"$f":"IF(J106=\"\",\"\",CONCATENATE(GORLIS!T107,\"--\",J106))","v":""},null,null,0,null,0,null,{"$f":"IF(GORLIS!S107=\"\",\"\",+GORLIS!S107)","v":""}]
[null,{"$f":"IF(GORLIS!B108=\"\",\"\",B106+1)","v":""},{"$f":"IF(GORLIS!B108=\"\",\"\",+GORLIS!B108)","v":""},{"$f":"IF(GORLIS!C108=\"\",\"\",+GORLIS!C108)","v":""},{"$f":"IF(GORLIS!D108=\"\",\"\",+GORLIS!D108)","v":""},{"$f":"IF(GORLIS!E108=\"\",\"\",+GORLIS!E108)","v":""},{"$f":"IF(GORLIS!F108=\"\",\"\",+GORLIS!F108)","v":""},{"$f":"IF(GORLIS!G108=\"\",\"\",+GORLIS!G108)","v":""},{"$f":"IF(GORLIS!H108=\"\",\"\",+GORLIS!H108)","v":""},{"$f":"IF(GORLIS!I108=\"\",\"\",+GORLIS!I108)","v":""},{"$f":"IF(GORLIS!J108=\"\",\"\",+GORLIS!J108)","v":""},null,null,{"$f":"IF(GORLIS!M108=\"\",\"\",+GORLIS!M108)","v":""},null,{"$f":"IF(GORLIS!O108=\"\",\"\",+GORLIS!O108)","v":""},{"$f":"IF(GORLIS!P108=\"\",\"\",+GORLIS!P108)","v":""},{"$f":"IF(GORLIS!Q108=\"\",\"\",+GORLIS!Q108)","v":""},{"$f":"IF(GORLIS!R108=\"\",\"\",+GORLIS!R108)","v":""},{"$f":"IF(J107=\"\",\"\",CONCATENATE(GORLIS!T108,\"--\",J107))","v":""},null,null,0,null,0,null,{"$f":"IF(GORLIS!S108=\"\",\"\",+GORLIS!S108)","v":""}]
[null,{"$f":"IF(GORLIS!B109=\"\",\"\",B107+1)","v":""},{"$f":"IF(GORLIS!B109=\"\",\"\",+GORLIS!B109)","v":""},{"$f":"IF(GORLIS!C109=\"\",\"\",+GORLIS!C109)","v":""},{"$f":"IF(GORLIS!D109=\"\",\"\",+GORLIS!D109)","v":""},{"$f":"IF(GORLIS!E109=\"\",\"\",+GORLIS!E109)","v":""},{"$f":"IF(GORLIS!F109=\"\",\"\",+GORLIS!F109)","v":""},{"$f":"IF(GORLIS!G109=\"\",\"\",+GORLIS!G109)","v":""},{"$f":"IF(GORLIS!H109=\"\",\"\",+GORLIS!H109)","v":""},{"$f":"IF(GORLIS!I109=\"\",\"\",+GORLIS!I109)","v":""},{"$f":"IF(GORLIS!J109=\"\",\"\",+GORLIS!J109)","v":""},null,null,{"$f":"IF(GORLIS!M109=\"\",\"\",+GORLIS!M109)","v":""},null,{"$f":"IF(GORLIS!O109=\"\",\"\",+GORLIS!O109)","v":""},{"$f":"IF(GORLIS!P109=\"\",\"\",+GORLIS!P109)","v":""},{"$f":"IF(GORLIS!Q109=\"\",\"\",+GORLIS!Q109)","v":""},{"$f":"IF(GORLIS!R109=\"\",\"\",+GORLIS!R109)","v":""},{"$f":"IF(J108=\"\",\"\",CONCATENATE(GORLIS!T109,\"--\",J108))","v":""},null,null,0,null,0,null,{"$f":"IF(GORLIS!S109=\"\",\"\",+GORLIS!S109)","v":""}]
[null,{"$f":"IF(GORLIS!B110=\"\",\"\",B108+1)","v":""},{"$f":"IF(GORLIS!B110=\"\",\"\",+GORLIS!B110)","v":""},{"$f":"IF(GORLIS!C110=\"\",\"\",+GORLIS!C110)","v":""},{"$f":"IF(GORLIS!D110=\"\",\"\",+GORLIS!D110)","v":""},{"$f":"IF(GORLIS!E110=\"\",\"\",+GORLIS!E110)","v":""},{"$f":"IF(GORLIS!F110=\"\",\"\",+GORLIS!F110)","v":""},{"$f":"IF(GORLIS!G110=\"\",\"\",+GORLIS!G110)","v":""},{"$f":"IF(GORLIS!H110=\"\",\"\",+GORLIS!H110)","v":""},{"$f":"IF(GORLIS!I110=\"\",\"\",+GORLIS!I110)","v":""},{"$f":"IF(GORLIS!J110=\"\",\"\",+GORLIS!J110)","v":""},null,null,{"$f":"IF(GORLIS!M110=\"\",\"\",+GORLIS!M110)","v":""},null,{"$f":"IF(GORLIS!O110=\"\",\"\",+GORLIS!O110)","v":""},{"$f":"IF(GORLIS!P110=\"\",\"\",+GORLIS!P110)","v":""},{"$f":"IF(GORLIS!Q110=\"\",\"\",+GORLIS!Q110)","v":""},{"$f":"IF(GORLIS!R110=\"\",\"\",+GORLIS!R110)","v":""},{"$f":"IF(J109=\"\",\"\",CONCATENATE(GORLIS!T110,\"--\",J109))","v":""},null,null,0,null,0,null,{"$f":"IF(GORLIS!S110=\"\",\"\",+GORLIS!S110)","v":""}]
[null,{"$f":"IF(GORLIS!B111=\"\",\"\",B109+1)","v":""},{"$f":"IF(GORLIS!B111=\"\",\"\",+GORLIS!B111)","v":""},{"$f":"IF(GORLIS!C111=\"\",\"\",+GORLIS!C111)","v":""},{"$f":"IF(GORLIS!D111=\"\",\"\",+GORLIS!D111)","v":""},{"$f":"IF(GORLIS!E111=\"\",\"\",+GORLIS!E111)","v":""},{"$f":"IF(GORLIS!F111=\"\",\"\",+GORLIS!F111)","v":""},{"$f":"IF(GORLIS!G111=\"\",\"\",+GORLIS!G111)","v":""},{"$f":"IF(GORLIS!H111=\"\",\"\",+GORLIS!H111)","v":""},{"$f":"IF(GORLIS!I111=\"\",\"\",+GORLIS!I111)","v":""},{"$f":"IF(GORLIS!J111=\"\",\"\",+GORLIS!J111)","v":""},null,null,{"$f":"IF(GORLIS!M111=\"\",\"\",+GORLIS!M111)","v":""},null,{"$f":"IF(GORLIS!O111=\"\",\"\",+GORLIS!O111)","v":""},{"$f":"IF(GORLIS!P111=\"\",\"\",+GORLIS!P111)","v":""},{"$f":"IF(GORLIS!Q111=\"\",\"\",+GORLIS!Q111)","v":""},{"$f":"IF(GORLIS!R111=\"\",\"\",+GORLIS!R111)","v":""},{"$f":"IF(J110=\"\",\"\",CONCATENATE(GORLIS!T111,\"--\",J110))","v":""},null,null,0,null,0,null,{"$f":"IF(GORLIS!S111=\"\",\"\",+GORLIS!S111)","v":""}]
[null,{"$f":"IF(GORLIS!B112=\"\",\"\",B110+1)","v":""},{"$f":"IF(GORLIS!B112=\"\",\"\",+GORLIS!B112)","v":""},{"$f":"IF(GORLIS!C112=\"\",\"\",+GORLIS!C112)","v":""},{"$f":"IF(GORLIS!D112=\"\",\"\",+GORLIS!D112)","v":""},{"$f":"IF(GORLIS!E112=\"\",\"\",+GORLIS!E112)","v":""},{"$f":"IF(GORLIS!F112=\"\",\"\",+GORLIS!F112)","v":""},{"$f":"IF(GORLIS!G112=\"\",\"\",+GORLIS!G112)","v":""},{"$f":"IF(GORLIS!H112=\"\",\"\",+GORLIS!H112)","v":""},{"$f":"IF(GORLIS!I112=\"\",\"\",+GORLIS!I112)","v":""},{"$f":"IF(GORLIS!J112=\"\",\"\",+GORLIS!J112)","v":""},null,null,{"$f":"IF(GORLIS!M112=\"\",\"\",+GORLIS!M112)","v":""},null,{"$f":"IF(GORLIS!O112=\"\",\"\",+GORLIS!O112)","v":""},{"$f":"IF(GORLIS!P112=\"\",\"\",+GORLIS!P112)","v":""},{"$f":"IF(GORLIS!Q112=\"\",\"\",+GORLIS!Q112)","v":""},{"$f":"IF(GORLIS!R112=\"\",\"\",+GORLIS!R112)","v":""},{"$f":"IF(J111=\"\",\"\",CONCATENATE(GORLIS!T112,\"--\",J111))","v":""},null,null,0,null,0,null,{"$f":"IF(GORLIS!S112=\"\",\"\",+GORLIS!S112)","v":""}]
[null,{"$f":"IF(GORLIS!B113=\"\",\"\",B111+1)","v":""},{"$f":"IF(GORLIS!B113=\"\",\"\",+GORLIS!B113)","v":""},{"$f":"IF(GORLIS!C113=\"\",\"\",+GORLIS!C113)","v":""},{"$f":"IF(GORLIS!D113=\"\",\"\",+GORLIS!D113)","v":""},{"$f":"IF(GORLIS!E113=\"\",\"\",+GORLIS!E113)","v":""},{"$f":"IF(GORLIS!F113=\"\",\"\",+GORLIS!F113)","v":""},{"$f":"IF(GORLIS!G113=\"\",\"\",+GORLIS!G113)","v":""},{"$f":"IF(GORLIS!H113=\"\",\"\",+GORLIS!H113)","v":""},{"$f":"IF(GORLIS!I113=\"\",\"\",+GORLIS!I113)","v":""},{"$f":"IF(GORLIS!J113=\"\",\"\",+GORLIS!J113)","v":""},null,null,{"$f":"IF(GORLIS!M113=\"\",\"\",+GORLIS!M113)","v":""},null,{"$f":"IF(GORLIS!O113=\"\",\"\",+GORLIS!O113)","v":""},{"$f":"IF(GORLIS!P113=\"\",\"\",+GORLIS!P113)","v":""},{"$f":"IF(GORLIS!Q113=\"\",\"\",+GORLIS!Q113)","v":""},{"$f":"IF(GORLIS!R113=\"\",\"\",+GORLIS!R113)","v":""},{"$f":"IF(J112=\"\",\"\",CONCATENATE(GORLIS!T113,\"--\",J112))","v":""},null,null,0,null,0,null,{"$f":"IF(GORLIS!S113=\"\",\"\",+GORLIS!S113)","v":""}]
[null,{"$f":"IF(GORLIS!B114=\"\",\"\",B112+1)","v":""},{"$f":"IF(GORLIS!B114=\"\",\"\",+GORLIS!B114)","v":""},{"$f":"IF(GORLIS!C114=\"\",\"\",+GORLIS!C114)","v":""},{"$f":"IF(GORLIS!D114=\"\",\"\",+GORLIS!D114)","v":""},{"$f":"IF(GORLIS!E114=\"\",\"\",+GORLIS!E114)","v":""},{"$f":"IF(GORLIS!F114=\"\",\"\",+GORLIS!F114)","v":""},{"$f":"IF(GORLIS!G114=\"\",\"\",+GORLIS!G114)","v":""},{"$f":"IF(GORLIS!H114=\"\",\"\",+GORLIS!H114)","v":""},{"$f":"IF(GORLIS!I114=\"\",\"\",+GORLIS!I114)","v":""},{"$f":"IF(GORLIS!J114=\"\",\"\",+GORLIS!J114)","v":""},null,null,{"$f":"IF(GORLIS!M114=\"\",\"\",+GORLIS!M114)","v":""},null,{"$f":"IF(GORLIS!O114=\"\",\"\",+GORLIS!O114)","v":""},{"$f":"IF(GORLIS!P114=\"\",\"\",+GORLIS!P114)","v":""},{"$f":"IF(GORLIS!Q114=\"\",\"\",+GORLIS!Q114)","v":""},{"$f":"IF(GORLIS!R114=\"\",\"\",+GORLIS!R114)","v":""},{"$f":"IF(J113=\"\",\"\",CONCATENATE(GORLIS!T114,\"--\",J113))","v":""},null,null,0,null,0,null,{"$f":"IF(GORLIS!S114=\"\",\"\",+GORLIS!S114)","v":""}]
[null,{"$f":"IF(GORLIS!B115=\"\",\"\",B113+1)","v":""},{"$f":"IF(GORLIS!B115=\"\",\"\",+GORLIS!B115)","v":""},{"$f":"IF(GORLIS!C115=\"\",\"\",+GORLIS!C115)","v":""},{"$f":"IF(GORLIS!D115=\"\",\"\",+GORLIS!D115)","v":""},{"$f":"IF(GORLIS!E115=\"\",\"\",+GORLIS!E115)","v":""},{"$f":"IF(GORLIS!F115=\"\",\"\",+GORLIS!F115)","v":""},{"$f":"IF(GORLIS!G115=\"\",\"\",+GORLIS!G115)","v":""},{"$f":"IF(GORLIS!H115=\"\",\"\",+GORLIS!H115)","v":""},{"$f":"IF(GORLIS!I115=\"\",\"\",+GORLIS!I115)","v":""},{"$f":"IF(GORLIS!J115=\"\",\"\",+GORLIS!J115)","v":""},null,null,{"$f":"IF(GORLIS!M115=\"\",\"\",+GORLIS!M115)","v":""},null,{"$f":"IF(GORLIS!O115=\"\",\"\",+GORLIS!O115)","v":""},{"$f":"IF(GORLIS!P115=\"\",\"\",+GORLIS!P115)","v":""},{"$f":"IF(GORLIS!Q115=\"\",\"\",+GORLIS!Q115)","v":""},{"$f":"IF(GORLIS!R115=\"\",\"\",+GORLIS!R115)","v":""},{"$f":"IF(J114=\"\",\"\",CONCATENATE(GORLIS!T115,\"--\",J114))","v":""},null,null,0,null,0,null,{"$f":"IF(GORLIS!S115=\"\",\"\",+GORLIS!S115)","v":""}]
[null,{"$f":"IF(GORLIS!B116=\"\",\"\",B114+1)","v":""},{"$f":"IF(GORLIS!B116=\"\",\"\",+GORLIS!B116)","v":""},{"$f":"IF(GORLIS!C116=\"\",\"\",+GORLIS!C116)","v":""},{"$f":"IF(GORLIS!D116=\"\",\"\",+GORLIS!D116)","v":""},{"$f":"IF(GORLIS!E116=\"\",\"\",+GORLIS!E116)","v":""},{"$f":"IF(GORLIS!F116=\"\",\"\",+GORLIS!F116)","v":""},{"$f":"IF(GORLIS!G116=\"\",\"\",+GORLIS!G116)","v":""},{"$f":"IF(GORLIS!H116=\"\",\"\",+GORLIS!H116)","v":""},{"$f":"IF(GORLIS!I116=\"\",\"\",+GORLIS!I116)","v":""},{"$f":"IF(GORLIS!J116=\"\",\"\",+GORLIS!J116)","v":""},null,null,{"$f":"IF(GORLIS!M116=\"\",\"\",+GORLIS!M116)","v":""},null,{"$f":"IF(GORLIS!O116=\"\",\"\",+GORLIS!O116)","v":""},{"$f":"IF(GORLIS!P116=\"\",\"\",+GORLIS!P116)","v":""},{"$f":"IF(GORLIS!Q116=\"\",\"\",+GORLIS!Q116)","v":""},{"$f":"IF(GORLIS!R116=\"\",\"\",+GORLIS!R116)","v":""},{"$f":"IF(J115=\"\",\"\",CONCATENATE(GORLIS!T116,\"--\",J115))","v":""},null,null,0,null,0,null,{"$f":"IF(GORLIS!S116=\"\",\"\",+GORLIS!S116)","v":""}]
[null,{"$f":"IF(GORLIS!B117=\"\",\"\",B115+1)","v":""},{"$f":"IF(GORLIS!B117=\"\",\"\",+GORLIS!B117)","v":""},{"$f":"IF(GORLIS!C117=\"\",\"\",+GORLIS!C117)","v":""},{"$f":"IF(GORLIS!D117=\"\",\"\",+GORLIS!D117)","v":""},{"$f":"IF(GORLIS!E117=\"\",\"\",+GORLIS!E117)","v":""},{"$f":"IF(GORLIS!F117=\"\",\"\",+GORLIS!F117)","v":""},{"$f":"IF(GORLIS!G117=\"\",\"\",+GORLIS!G117)","v":""},null,{"$f":"IF(GORLIS!I117=\"\",\"\",+GORLIS!I117)","v":""},{"$f":"IF(GORLIS!J117=\"\",\"\",+GORLIS!J117)","v":""},null,null,{"$f":"IF(GORLIS!M117=\"\",\"\",+GORLIS!M117)","v":""},null,{"$f":"IF(GORLIS!O117=\"\",\"\",+GORLIS!O117)","v":""},{"$f":"IF(GORLIS!P117=\"\",\"\",+GORLIS!P117)","v":""},{"$f":"IF(GORLIS!Q117=\"\",\"\",+GORLIS!Q117)","v":""},{"$f":"IF(GORLIS!R117=\"\",\"\",+GORLIS!R117)","v":""},{"$f":"IF(J116=\"\",\"\",CONCATENATE(GORLIS!T117,\"--\",J116))","v":""},null,null,0,null,0,null,{"$f":"IF(GORLIS!S117=\"\",\"\",+GORLIS!S117)","v":""}]
[null,{"$f":"IF(GORLIS!B118=\"\",\"\",B116+1)","v":""},{"$f":"IF(GORLIS!B118=\"\",\"\",+GORLIS!B118)","v":""},{"$f":"IF(GORLIS!C118=\"\",\"\",+GORLIS!C118)","v":""},{"$f":"IF(GORLIS!D118=\"\",\"\",+GORLIS!D118)","v":""},{"$f":"IF(GORLIS!E118=\"\",\"\",+GORLIS!E118)","v":""},{"$f":"IF(GORLIS!F118=\"\",\"\",+GORLIS!F118)","v":""},{"$f":"IF(GORLIS!G118=\"\",\"\",+GORLIS!G118)","v":""},{"$f":"IF(GORLIS!H118=\"\",\"\",+GORLIS!H118)","v":""},{"$f":"IF(GORLIS!I118=\"\",\"\",+GORLIS!I118)","v":""},{"$f":"IF(GORLIS!J118=\"\",\"\",+GORLIS!J118)","v":""},null,null,{"$f":"IF(GORLIS!M118=\"\",\"\",+GORLIS!M118)","v":""},null,{"$f":"IF(GORLIS!O118=\"\",\"\",+GORLIS!O118)","v":""},{"$f":"IF(GORLIS!P118=\"\",\"\",+GORLIS!P118)","v":""},{"$f":"IF(GORLIS!Q118=\"\",\"\",+GORLIS!Q118)","v":""},{"$f":"IF(GORLIS!R118=\"\",\"\",+GORLIS!R118)","v":""},{"$f":"IF(J117=\"\",\"\",CONCATENATE(GORLIS!T118,\"--\",J117))","v":""},null,null,0,null,0,null,{"$f":"IF(GORLIS!S118=\"\",\"\",+GORLIS!S118)","v":""}]
[null,{"$f":"IF(GORLIS!B119=\"\",\"\",B117+1)","v":""},{"$f":"IF(GORLIS!B119=\"\",\"\",+GORLIS!B119)","v":""},{"$f":"IF(GORLIS!C119=\"\",\"\",+GORLIS!C119)","v":""},{"$f":"IF(GORLIS!D119=\"\",\"\",+GORLIS!D119)","v":""},{"$f":"IF(GORLIS!E119=\"\",\"\",+GORLIS!E119)","v":""},{"$f":"IF(GORLIS!F119=\"\",\"\",+GORLIS!F119)","v":""},{"$f":"IF(GORLIS!G119=\"\",\"\",+GORLIS!G119)","v":""},{"$f":"IF(GORLIS!H119=\"\",\"\",+GORLIS!H119)","v":""},{"$f":"IF(GORLIS!I119=\"\",\"\",+GORLIS!I119)","v":""},{"$f":"IF(GORLIS!J119=\"\",\"\",+GORLIS!J119)","v":""},null,null,{"$f":"IF(GORLIS!M119=\"\",\"\",+GORLIS!M119)","v":""},null,{"$f":"IF(GORLIS!O119=\"\",\"\",+GORLIS!O119)","v":""},{"$f":"IF(GORLIS!P119=\"\",\"\",+GORLIS!P119)","v":""},{"$f":"IF(GORLIS!Q119=\"\",\"\",+GORLIS!Q119)","v":""},{"$f":"IF(GORLIS!R119=\"\",\"\",+GORLIS!R119)","v":""},{"$f":"IF(J118=\"\",\"\",CONCATENATE(GORLIS!T119,\"--\",J118))","v":""},null,null,0,null,0,null,{"$f":"IF(GORLIS!S119=\"\",\"\",+GORLIS!S119)","v":""}]
[null,{"$f":"IF(GORLIS!B120=\"\",\"\",B118+1)","v":""},{"$f":"IF(GORLIS!B120=\"\",\"\",+GORLIS!B120)","v":""},{"$f":"IF(GORLIS!C120=\"\",\"\",+GORLIS!C120)","v":""},{"$f":"IF(GORLIS!D120=\"\",\"\",+GORLIS!D120)","v":""},{"$f":"IF(GORLIS!E120=\"\",\"\",+GORLIS!E120)","v":""},{"$f":"IF(GORLIS!F120=\"\",\"\",+GORLIS!F120)","v":""},{"$f":"IF(GORLIS!G120=\"\",\"\",+GORLIS!G120)","v":""},{"$f":"IF(GORLIS!H120=\"\",\"\",+GORLIS!H120)","v":""},{"$f":"IF(GORLIS!I120=\"\",\"\",+GORLIS!I120)","v":""},{"$f":"IF(GORLIS!J120=\"\",\"\",+GORLIS!J120)","v":""},null,null,{"$f":"IF(GORLIS!M120=\"\",\"\",+GORLIS!M120)","v":""},null,{"$f":"IF(GORLIS!O120=\"\",\"\",+GORLIS!O120)","v":""},{"$f":"IF(GORLIS!P120=\"\",\"\",+GORLIS!P120)","v":""},{"$f":"IF(GORLIS!Q120=\"\",\"\",+GORLIS!Q120)","v":""},{"$f":"IF(GORLIS!R120=\"\",\"\",+GORLIS!R120)","v":""},{"$f":"IF(J119=\"\",\"\",CONCATENATE(GORLIS!T120,\"--\",J119))","v":""},null,null,0,null,0,null,{"$f":"IF(GORLIS!S120=\"\",\"\",+GORLIS!S120)","v":""}]
[null,{"$f":"IF(GORLIS!B121=\"\",\"\",B119+1)","v":""},{"$f":"IF(GORLIS!B121=\"\",\"\",+GORLIS!B121)","v":""},{"$f":"IF(GORLIS!C121=\"\",\"\",+GORLIS!C121)","v":""},{"$f":"IF(GORLIS!D121=\"\",\"\",+GORLIS!D121)","v":""},{"$f":"IF(GORLIS!E121=\"\",\"\",+GORLIS!E121)","v":""},{"$f":"IF(GORLIS!F121=\"\",\"\",+GORLIS!F121)","v":""},{"$f":"IF(GORLIS!G121=\"\",\"\",+GORLIS!G121)","v":""},{"$f":"IF(GORLIS!H121=\"\",\"\",+GORLIS!H121)","v":""},{"$f":"IF(GORLIS!I121=\"\",\"\",+GORLIS!I121)","v":""},{"$f":"IF(GORLIS!J121=\"\",\"\",+GORLIS!J121)","v":""},null,null,{"$f":"IF(GORLIS!M121=\"\",\"\",+GORLIS!M121)","v":""},null,{"$f":"IF(GORLIS!O121=\"\",\"\",+GORLIS!O121)","v":""},{"$f":"IF(GORLIS!P121=\"\",\"\",+GORLIS!P121)","v":""},{"$f":"IF(GORLIS!Q121=\"\",\"\",+GORLIS!Q121)","v":""},{"$f":"IF(GORLIS!R121=\"\",\"\",+GORLIS!R121)","v":""},{"$f":"IF(J120=\"\",\"\",CONCATENATE(GORLIS!T121,\"--\",J120))","v":""},null,null,0,null,0,null,{"$f":"IF(GORLIS!S121=\"\",\"\",+GORLIS!S121)","v":""}]
[null,{"$f":"IF(GORLIS!B122=\"\",\"\",B120+1)","v":""},{"$f":"IF(GORLIS!B122=\"\",\"\",+GORLIS!B122)","v":""},{"$f":"IF(GORLIS!C122=\"\",\"\",+GORLIS!C122)","v":""},{"$f":"IF(GORLIS!D122=\"\",\"\",+GORLIS!D122)","v":""},{"$f":"IF(GORLIS!E122=\"\",\"\",+GORLIS!E122)","v":""},{"$f":"IF(GORLIS!F122=\"\",\"\",+GORLIS!F122)","v":""},{"$f":"IF(GORLIS!G122=\"\",\"\",+GORLIS!G122)","v":""},{"$f":"IF(GORLIS!H122=\"\",\"\",+GORLIS!H122)","v":""},{"$f":"IF(GORLIS!I122=\"\",\"\",+GORLIS!I122)","v":""},{"$f":"IF(GORLIS!J122=\"\",\"\",+GORLIS!J122)","v":""},null,null,{"$f":"IF(GORLIS!M122=\"\",\"\",+GORLIS!M122)","v":""},null,{"$f":"IF(GORLIS!O122=\"\",\"\",+GORLIS!O122)","v":""},{"$f":"IF(GORLIS!P122=\"\",\"\",+GORLIS!P122)","v":""},{"$f":"IF(GORLIS!Q122=\"\",\"\",+GORLIS!Q122)","v":""},{"$f":"IF(GORLIS!R122=\"\",\"\",+GORLIS!R122)","v":""},{"$f":"IF(J121=\"\",\"\",CONCATENATE(GORLIS!T122,\"--\",J121))","v":""},null,null,0,null,0,null,{"$f":"IF(GORLIS!S122=\"\",\"\",+GORLIS!S122)","v":""}]
[null,{"$f":"IF(GORLIS!B123=\"\",\"\",B121+1)","v":""},{"$f":"IF(GORLIS!B123=\"\",\"\",+GORLIS!B123)","v":""},{"$f":"IF(GORLIS!C123=\"\",\"\",+GORLIS!C123)","v":""},{"$f":"IF(GORLIS!D123=\"\",\"\",+GORLIS!D123)","v":""},{"$f":"IF(GORLIS!E123=\"\",\"\",+GORLIS!E123)","v":""},{"$f":"IF(GORLIS!F123=\"\",\"\",+GORLIS!F123)","v":""},{"$f":"IF(GORLIS!G123=\"\",\"\",+GORLIS!G123)","v":""},{"$f":"IF(GORLIS!H123=\"\",\"\",+GORLIS!H123)","v":""},{"$f":"IF(GORLIS!I123=\"\",\"\",+GORLIS!I123)","v":""},{"$f":"IF(GORLIS!J123=\"\",\"\",+GORLIS!J123)","v":""},null,null,{"$f":"IF(GORLIS!M123=\"\",\"\",+GORLIS!M123)","v":""},null,{"$f":"IF(GORLIS!O123=\"\",\"\",+GORLIS!O123)","v":""},{"$f":"IF(GORLIS!P123=\"\",\"\",+GORLIS!P123)","v":""},{"$f":"IF(GORLIS!Q123=\"\",\"\",+GORLIS!Q123)","v":""},{"$f":"IF(GORLIS!R123=\"\",\"\",+GORLIS!R123)","v":""},{"$f":"IF(J122=\"\",\"\",CONCATENATE(GORLIS!T123,\"--\",J122))","v":""},null,null,0,null,0,null,{"$f":"IF(GORLIS!S123=\"\",\"\",+GORLIS!S123)","v":""}]
[null,{"$f":"IF(GORLIS!B124=\"\",\"\",B122+1)","v":""},{"$f":"IF(GORLIS!B124=\"\",\"\",+GORLIS!B124)","v":""},{"$f":"IF(GORLIS!C124=\"\",\"\",+GORLIS!C124)","v":""},{"$f":"IF(GORLIS!D124=\"\",\"\",+GORLIS!D124)","v":""},{"$f":"IF(GORLIS!E124=\"\",\"\",+GORLIS!E124)","v":""},{"$f":"IF(GORLIS!F124=\"\",\"\",+GORLIS!F124)","v":""},{"$f":"IF(GORLIS!G124=\"\",\"\",+GORLIS!G124)","v":""},{"$f":"IF(GORLIS!H124=\"\",\"\",+GORLIS!H124)","v":""},{"$f":"IF(GORLIS!I124=\"\",\"\",+GORLIS!I124)","v":""},{"$f":"IF(GORLIS!J124=\"\",\"\",+GORLIS!J124)","v":""},null,null,{"$f":"IF(GORLIS!M124=\"\",\"\",+GORLIS!M124)","v":""},null,{"$f":"IF(GORLIS!O124=\"\",\"\",+GORLIS!O124)","v":""},{"$f":"IF(GORLIS!P124=\"\",\"\",+GORLIS!P124)","v":""},{"$f":"IF(GORLIS!Q124=\"\",\"\",+GORLIS!Q124)","v":""},{"$f":"IF(GORLIS!R124=\"\",\"\",+GORLIS!R124)","v":""},{"$f":"IF(J123=\"\",\"\",CONCATENATE(GORLIS!T124,\"--\",J123))","v":""},null,null,0,null,0,null,{"$f":"IF(GORLIS!S124=\"\",\"\",+GORLIS!S124)","v":""}]
[null,{"$f":"IF(GORLIS!B125=\"\",\"\",B123+1)","v":""},{"$f":"IF(GORLIS!B125=\"\",\"\",+GORLIS!B125)","v":""},{"$f":"IF(GORLIS!C125=\"\",\"\",+GORLIS!C125)","v":""},{"$f":"IF(GORLIS!D125=\"\",\"\",+GORLIS!D125)","v":""},{"$f":"IF(GORLIS!E125=\"\",\"\",+GORLIS!E125)","v":""},{"$f":"IF(GORLIS!F125=\"\",\"\",+GORLIS!F125)","v":""},{"$f":"IF(GORLIS!G125=\"\",\"\",+GORLIS!G125)","v":""},{"$f":"IF(GORLIS!H125=\"\",\"\",+GORLIS!H125)","v":""},{"$f":"IF(GORLIS!I125=\"\",\"\",+GORLIS!I125)","v":""},{"$f":"IF(GORLIS!J125=\"\",\"\",+GORLIS!J125)","v":""},null,null,{"$f":"IF(GORLIS!M125=\"\",\"\",+GORLIS!M125)","v":""},null,{"$f":"IF(GORLIS!O125=\"\",\"\",+GORLIS!O125)","v":""},{"$f":"IF(GORLIS!P125=\"\",\"\",+GORLIS!P125)","v":""},{"$f":"IF(GORLIS!Q125=\"\",\"\",+GORLIS!Q125)","v":""},{"$f":"IF(GORLIS!R125=\"\",\"\",+GORLIS!R125)","v":""},{"$f":"IF(J124=\"\",\"\",CONCATENATE(GORLIS!T125,\"--\",J124))","v":""},null,null,0,null,0,null,{"$f":"IF(GORLIS!S125=\"\",\"\",+GORLIS!S125)","v":""}]
[null,{"$f":"IF(GORLIS!B126=\"\",\"\",B124+1)","v":""},{"$f":"IF(GORLIS!B126=\"\",\"\",+GORLIS!B126)","v":""},{"$f":"IF(GORLIS!C126=\"\",\"\",+GORLIS!C126)","v":""},{"$f":"IF(GORLIS!D126=\"\",\"\",+GORLIS!D126)","v":""},{"$f":"IF(GORLIS!E126=\"\",\"\",+GORLIS!E126)","v":""},{"$f":"IF(GORLIS!F126=\"\",\"\",+GORLIS!F126)","v":""},{"$f":"IF(GORLIS!G126=\"\",\"\",+GORLIS!G126)","v":""},{"$f":"IF(GORLIS!H126=\"\",\"\",+GORLIS!H126)","v":""},{"$f":"IF(GORLIS!I126=\"\",\"\",+GORLIS!I126)","v":""},{"$f":"IF(GORLIS!J126=\"\",\"\",+GORLIS!J126)","v":""},null,null,{"$f":"IF(GORLIS!M126=\"\",\"\",+GORLIS!M126)","v":""},null,{"$f":"IF(GORLIS!O126=\"\",\"\",+GORLIS!O126)","v":""},{"$f":"IF(GORLIS!P126=\"\",\"\",+GORLIS!P126)","v":""},{"$f":"IF(GORLIS!Q126=\"\",\"\",+GORLIS!Q126)","v":""},{"$f":"IF(GORLIS!R126=\"\",\"\",+GORLIS!R126)","v":""},{"$f":"IF(J125=\"\",\"\",CONCATENATE(GORLIS!T126,\"--\",J125))","v":""},null,null,0,null,0,null,{"$f":"IF(GORLIS!S126=\"\",\"\",+GORLIS!S126)","v":""}]
[null,{"$f":"IF(GORLIS!B127=\"\",\"\",B125+1)","v":""},{"$f":"IF(GORLIS!B127=\"\",\"\",+GORLIS!B127)","v":""},{"$f":"IF(GORLIS!C127=\"\",\"\",+GORLIS!C127)","v":""},{"$f":"IF(GORLIS!D127=\"\",\"\",+GORLIS!D127)","v":""},{"$f":"IF(GORLIS!E127=\"\",\"\",+GORLIS!E127)","v":""},{"$f":"IF(GORLIS!F127=\"\",\"\",+GORLIS!F127)","v":""},{"$f":"IF(GORLIS!G127=\"\",\"\",+GORLIS!G127)","v":""},{"$f":"IF(GORLIS!H127=\"\",\"\",+GORLIS!H127)","v":""},{"$f":"IF(GORLIS!I127=\"\",\"\",+GORLIS!I127)","v":""},{"$f":"IF(GORLIS!J127=\"\",\"\",+GORLIS!J127)","v":""},null,null,{"$f":"IF(GORLIS!M127=\"\",\"\",+GORLIS!M127)","v":""},null,{"$f":"IF(GORLIS!O127=\"\",\"\",+GORLIS!O127)","v":""},{"$f":"IF(GORLIS!P127=\"\",\"\",+GORLIS!P127)","v":""},{"$f":"IF(GORLIS!Q127=\"\",\"\",+GORLIS!Q127)","v":""},{"$f":"IF(GORLIS!R127=\"\",\"\",+GORLIS!R127)","v":""},{"$f":"IF(J126=\"\",\"\",CONCATENATE(GORLIS!T127,\"--\",J126))","v":""},null,null,0,null,0,null,{"$f":"IF(GORLIS!S127=\"\",\"\",+GORLIS!S127)","v":""}]
[null,{"$f":"IF(GORLIS!B128=\"\",\"\",B126+1)","v":""},{"$f":"IF(GORLIS!B128=\"\",\"\",+GORLIS!B128)","v":""},{"$f":"IF(GORLIS!C128=\"\",\"\",+GORLIS!C128)","v":""},{"$f":"IF(GORLIS!D128=\"\",\"\",+GORLIS!D128)","v":""},{"$f":"IF(GORLIS!E128=\"\",\"\",+GORLIS!E128)","v":""},{"$f":"IF(GORLIS!F128=\"\",\"\",+GORLIS!F128)","v":""},{"$f":"IF(GORLIS!G128=\"\",\"\",+GORLIS!G128)","v":""},{"$f":"IF(GORLIS!H128=\"\",\"\",+GORLIS!H128)","v":""},{"$f":"IF(GORLIS!I128=\"\",\"\",+GORLIS!I128)","v":""},{"$f":"IF(GORLIS!J128=\"\",\"\",+GORLIS!J128)","v":""},null,null,{"$f":"IF(GORLIS!M128=\"\",\"\",+GORLIS!M128)","v":""},null,{"$f":"IF(GORLIS!O128=\"\",\"\",+GORLIS!O128)","v":""},{"$f":"IF(GORLIS!P128=\"\",\"\",+GORLIS!P128)","v":""},{"$f":"IF(GORLIS!Q128=\"\",\"\",+GORLIS!Q128)","v":""},{"$f":"IF(GORLIS!R128=\"\",\"\",+GORLIS!R128)","v":""},{"$f":"IF(J127=\"\",\"\",CONCATENATE(GORLIS!T128,\"--\",J127))","v":""},null,null,0,null,0,null,{"$f":"IF(GORLIS!S128=\"\",\"\",+GORLIS!S128)","v":""}]
[null,{"$f":"IF(GORLIS!B129=\"\",\"\",B127+1)","v":""},{"$f":"IF(GORLIS!B129=\"\",\"\",+GORLIS!B129)","v":""},{"$f":"IF(GORLIS!C129=\"\",\"\",+GORLIS!C129)","v":""},{"$f":"IF(GORLIS!D129=\"\",\"\",+GORLIS!D129)","v":""},{"$f":"IF(GORLIS!E129=\"\",\"\",+GORLIS!E129)","v":""},{"$f":"IF(GORLIS!F129=\"\",\"\",+GORLIS!F129)","v":""},{"$f":"IF(GORLIS!G129=\"\",\"\",+GORLIS!G129)","v":""},{"$f":"IF(GORLIS!H129=\"\",\"\",+GORLIS!H129)","v":""},{"$f":"IF(GORLIS!I129=\"\",\"\",+GORLIS!I129)","v":""},{"$f":"IF(GORLIS!J129=\"\",\"\",+GORLIS!J129)","v":""},null,null,{"$f":"IF(GORLIS!M129=\"\",\"\",+GORLIS!M129)","v":""},null,{"$f":"IF(GORLIS!O129=\"\",\"\",+GORLIS!O129)","v":""},{"$f":"IF(GORLIS!P129=\"\",\"\",+GORLIS!P129)","v":""},{"$f":"IF(GORLIS!Q129=\"\",\"\",+GORLIS!Q129)","v":""},{"$f":"IF(GORLIS!R129=\"\",\"\",+GORLIS!R129)","v":""},{"$f":"IF(J128=\"\",\"\",CONCATENATE(GORLIS!T129,\"--\",J128))","v":""},null,null,0,null,0,null,{"$f":"IF(GORLIS!S129=\"\",\"\",+GORLIS!S129)","v":""}]
[null,{"$f":"IF(GORLIS!B130=\"\",\"\",B128+1)","v":""},{"$f":"IF(GORLIS!B130=\"\",\"\",+GORLIS!B130)","v":""},{"$f":"IF(GORLIS!C130=\"\",\"\",+GORLIS!C130)","v":""},{"$f":"IF(GORLIS!D130=\"\",\"\",+GORLIS!D130)","v":""},{"$f":"IF(GORLIS!E130=\"\",\"\",+GORLIS!E130)","v":""},{"$f":"IF(GORLIS!F130=\"\",\"\",+GORLIS!F130)","v":""},{"$f":"IF(GORLIS!G130=\"\",\"\",+GORLIS!G130)","v":""},{"$f":"IF(GORLIS!H130=\"\",\"\",+GORLIS!H130)","v":""},{"$f":"IF(GORLIS!I130=\"\",\"\",+GORLIS!I130)","v":""},{"$f":"IF(GORLIS!J130=\"\",\"\",+GORLIS!J130)","v":""},null,null,{"$f":"IF(GORLIS!M130=\"\",\"\",+GORLIS!M130)","v":""},null,{"$f":"IF(GORLIS!O130=\"\",\"\",+GORLIS!O130)","v":""},{"$f":"IF(GORLIS!P130=\"\",\"\",+GORLIS!P130)","v":""},{"$f":"IF(GORLIS!Q130=\"\",\"\",+GORLIS!Q130)","v":""},{"$f":"IF(GORLIS!R130=\"\",\"\",+GORLIS!R130)","v":""},{"$f":"IF(J129=\"\",\"\",CONCATENATE(GORLIS!T130,\"--\",J129))","v":""},null,null,0,null,0,null,{"$f":"IF(GORLIS!S130=\"\",\"\",+GORLIS!S130)","v":""}]
[null,{"$f":"IF(GORLIS!B131=\"\",\"\",B129+1)","v":""},{"$f":"IF(GORLIS!B131=\"\",\"\",+GORLIS!B131)","v":""},{"$f":"IF(GORLIS!C131=\"\",\"\",+GORLIS!C131)","v":""},{"$f":"IF(GORLIS!D131=\"\",\"\",+GORLIS!D131)","v":""},{"$f":"IF(GORLIS!E131=\"\",\"\",+GORLIS!E131)","v":""},{"$f":"IF(GORLIS!F131=\"\",\"\",+GORLIS!F131)","v":""},{"$f":"IF(GORLIS!G131=\"\",\"\",+GORLIS!G131)","v":""},{"$f":"IF(GORLIS!H131=\"\",\"\",+GORLIS!H131)","v":""},{"$f":"IF(GORLIS!I131=\"\",\"\",+GORLIS!I131)","v":""},{"$f":"IF(GORLIS!J131=\"\",\"\",+GORLIS!J131)","v":""},null,null,{"$f":"IF(GORLIS!M131=\"\",\"\",+GORLIS!M131)","v":""},null,{"$f":"IF(GORLIS!O131=\"\",\"\",+GORLIS!O131)","v":""},{"$f":"IF(GORLIS!P131=\"\",\"\",+GORLIS!P131)","v":""},{"$f":"IF(GORLIS!Q131=\"\",\"\",+GORLIS!Q131)","v":""},{"$f":"IF(GORLIS!R131=\"\",\"\",+GORLIS!R131)","v":""},{"$f":"IF(J130=\"\",\"\",CONCATENATE(GORLIS!T131,\"--\",J130))","v":""},null,null,0,null,0,null,{"$f":"IF(GORLIS!S131=\"\",\"\",+GORLIS!S131)","v":""}]
[null,{"$f":"IF(GORLIS!B132=\"\",\"\",B130+1)","v":""},{"$f":"IF(GORLIS!B132=\"\",\"\",+GORLIS!B132)","v":""},{"$f":"IF(GORLIS!C132=\"\",\"\",+GORLIS!C132)","v":""},{"$f":"IF(GORLIS!D132=\"\",\"\",+GORLIS!D132)","v":""},{"$f":"IF(GORLIS!E132=\"\",\"\",+GORLIS!E132)","v":""},{"$f":"IF(GORLIS!F132=\"\",\"\",+GORLIS!F132)","v":""},{"$f":"IF(GORLIS!G132=\"\",\"\",+GORLIS!G132)","v":""},{"$f":"IF(GORLIS!H132=\"\",\"\",+GORLIS!H132)","v":""},{"$f":"IF(GORLIS!I132=\"\",\"\",+GORLIS!I132)","v":""},{"$f":"IF(GORLIS!J132=\"\",\"\",+GORLIS!J132)","v":""},null,null,{"$f":"IF(GORLIS!M132=\"\",\"\",+GORLIS!M132)","v":""},null,{"$f":"IF(GORLIS!O132=\"\",\"\",+GORLIS!O132)","v":""},{"$f":"IF(GORLIS!P132=\"\",\"\",+GORLIS!P132)","v":""},{"$f":"IF(GORLIS!Q132=\"\",\"\",+GORLIS!Q132)","v":""},{"$f":"IF(GORLIS!R132=\"\",\"\",+GORLIS!R132)","v":""},{"$f":"IF(J131=\"\",\"\",CONCATENATE(GORLIS!T132,\"--\",J131))","v":""},null,null,0,null,0,null,{"$f":"IF(GORLIS!S132=\"\",\"\",+GORLIS!S132)","v":""}]
[null,{"$f":"IF(GORLIS!B133=\"\",\"\",B131+1)","v":""},{"$f":"IF(GORLIS!B133=\"\",\"\",+GORLIS!B133)","v":""},{"$f":"IF(GORLIS!C133=\"\",\"\",+GORLIS!C133)","v":""},{"$f":"IF(GORLIS!D133=\"\",\"\",+GORLIS!D133)","v":""},{"$f":"IF(GORLIS!E133=\"\",\"\",+GORLIS!E133)","v":""},{"$f":"IF(GORLIS!F133=\"\",\"\",+GORLIS!F133)","v":""},{"$f":"IF(GORLIS!G133=\"\",\"\",+GORLIS!G133)","v":""},{"$f":"IF(GORLIS!H133=\"\",\"\",+GORLIS!H133)","v":""},{"$f":"IF(GORLIS!I133=\"\",\"\",+GORLIS!I133)","v":""},{"$f":"IF(GORLIS!J133=\"\",\"\",+GORLIS!J133)","v":""},null,null,{"$f":"IF(GORLIS!M133=\"\",\"\",+GORLIS!M133)","v":""},null,{"$f":"IF(GORLIS!O133=\"\",\"\",+GORLIS!O133)","v":""},{"$f":"IF(GORLIS!P133=\"\",\"\",+GORLIS!P133)","v":""},{"$f":"IF(GORLIS!Q133=\"\",\"\",+GORLIS!Q133)","v":""},{"$f":"IF(GORLIS!R133=\"\",\"\",+GORLIS!R133)","v":""},{"$f":"IF(J132=\"\",\"\",CONCATENATE(GORLIS!T133,\"--\",J132))","v":""},null,null,{"$f":"IF(V132-U132>M132,+M132,IF((V132-U132)>10,10,(V132-U132)))","v":0},null,{"$f":"IF(G132=\"\",0,IF(W132<=0,0,IF(W132*((G132*0.5)+G132)>=X132,+X132,W132*((G132*0.5)+G132))))","v":0},null,{"$f":"IF(GORLIS!S133=\"\",\"\",+GORLIS!S133)","v":""}]
[null,{"$f":"IF(GORLIS!B134=\"\",\"\",B132+1)","v":""},{"$f":"IF(GORLIS!B134=\"\",\"\",+GORLIS!B134)","v":""},{"$f":"IF(GORLIS!C134=\"\",\"\",+GORLIS!C134)","v":""},{"$f":"IF(GORLIS!D134=\"\",\"\",+GORLIS!D134)","v":""},{"$f":"IF(GORLIS!E134=\"\",\"\",+GORLIS!E134)","v":""},{"$f":"IF(GORLIS!F134=\"\",\"\",+GORLIS!F134)","v":""},{"$f":"IF(GORLIS!G134=\"\",\"\",+GORLIS!G134)","v":""},{"$f":"IF(GORLIS!H134=\"\",\"\",+GORLIS!H134)","v":""},{"$f":"IF(GORLIS!I134=\"\",\"\",+GORLIS!I134)","v":""},{"$f":"IF(GORLIS!J134=\"\",\"\",+GORLIS!J134)","v":""},null,null,{"$f":"IF(GORLIS!M134=\"\",\"\",+GORLIS!M134)","v":""},null,{"$f":"IF(GORLIS!O134=\"\",\"\",+GORLIS!O134)","v":""},{"$f":"IF(GORLIS!P134=\"\",\"\",+GORLIS!P134)","v":""},{"$f":"IF(GORLIS!Q134=\"\",\"\",+GORLIS!Q134)","v":""},{"$f":"IF(GORLIS!R134=\"\",\"\",+GORLIS!R134)","v":""},{"$f":"IF(J133=\"\",\"\",CONCATENATE(GORLIS!T134,\"--\",J133))","v":""},null,null,0,null,0,null,{"$f":"IF(GORLIS!S134=\"\",\"\",+GORLIS!S134)","v":""}]
[null,{"$f":"IF(GORLIS!B135=\"\",\"\",B133+1)","v":""},{"$f":"IF(GORLIS!B135=\"\",\"\",+GORLIS!B135)","v":""},{"$f":"IF(GORLIS!C135=\"\",\"\",+GORLIS!C135)","v":""},{"$f":"IF(GORLIS!D135=\"\",\"\",+GORLIS!D135)","v":""},{"$f":"IF(GORLIS!E135=\"\",\"\",+GORLIS!E135)","v":""},{"$f":"IF(GORLIS!F135=\"\",\"\",+GORLIS!F135)","v":""},{"$f":"IF(GORLIS!G135=\"\",\"\",+GORLIS!G135)","v":""},{"$f":"IF(GORLIS!H135=\"\",\"\",+GORLIS!H135)","v":""},{"$f":"IF(GORLIS!I135=\"\",\"\",+GORLIS!I135)","v":""},{"$f":"IF(GORLIS!J135=\"\",\"\",+GORLIS!J135)","v":""},null,null,{"$f":"IF(GORLIS!M135=\"\",\"\",+GORLIS!M135)","v":""},null,{"$f":"IF(GORLIS!O135=\"\",\"\",+GORLIS!O135)","v":""},{"$f":"IF(GORLIS!P135=\"\",\"\",+GORLIS!P135)","v":""},{"$f":"IF(GORLIS!Q135=\"\",\"\",+GORLIS!Q135)","v":""},{"$f":"IF(GORLIS!R135=\"\",\"\",+GORLIS!R135)","v":""},{"$f":"IF(J134=\"\",\"\",CONCATENATE(GORLIS!T135,\"--\",J134))","v":""},null,null,0,null,0,null,{"$f":"IF(GORLIS!S135=\"\",\"\",+GORLIS!S135)","v":""}]
[null,{"$f":"IF(GORLIS!B136=\"\",\"\",B134+1)","v":""},{"$f":"IF(GORLIS!B136=\"\",\"\",+GORLIS!B136)","v":""},{"$f":"IF(GORLIS!C136=\"\",\"\",+GORLIS!C136)","v":""},{"$f":"IF(GORLIS!D136=\"\",\"\",+GORLIS!D136)","v":""},{"$f":"IF(GORLIS!E136=\"\",\"\",+GORLIS!E136)","v":""},{"$f":"IF(GORLIS!F136=\"\",\"\",+GORLIS!F136)","v":""},{"$f":"IF(GORLIS!G136=\"\",\"\",+GORLIS!G136)","v":""},{"$f":"IF(GORLIS!H136=\"\",\"\",+GORLIS!H136)","v":""},{"$f":"IF(GORLIS!I136=\"\",\"\",+GORLIS!I136)","v":""},{"$f":"IF(GORLIS!J136=\"\",\"\",+GORLIS!J136)","v":""},null,null,{"$f":"IF(GORLIS!M136=\"\",\"\",+GORLIS!M136)","v":""},null,{"$f":"IF(GORLIS!O136=\"\",\"\",+GORLIS!O136)","v":""},{"$f":"IF(GORLIS!P136=\"\",\"\",+GORLIS!P136)","v":""},{"$f":"IF(GORLIS!Q136=\"\",\"\",+GORLIS!Q136)","v":""},{"$f":"IF(GORLIS!R136=\"\",\"\",+GORLIS!R136)","v":""},{"$f":"IF(J135=\"\",\"\",CONCATENATE(GORLIS!T136,\"--\",J135))","v":""},null,null,0,null,0,null,{"$f":"IF(GORLIS!S136=\"\",\"\",+GORLIS!S136)","v":""}]
[null,{"$f":"IF(GORLIS!B137=\"\",\"\",B135+1)","v":""},{"$f":"IF(GORLIS!B137=\"\",\"\",+GORLIS!B137)","v":""},{"$f":"IF(GORLIS!C137=\"\",\"\",+GORLIS!C137)","v":""},{"$f":"IF(GORLIS!D137=\"\",\"\",+GORLIS!D137)","v":""},{"$f":"IF(GORLIS!E137=\"\",\"\",+GORLIS!E137)","v":""},{"$f":"IF(GORLIS!F137=\"\",\"\",+GORLIS!F137)","v":""},{"$f":"IF(GORLIS!G137=\"\",\"\",+GORLIS!G137)","v":""},{"$f":"IF(GORLIS!H137=\"\",\"\",+GORLIS!H137)","v":""},{"$f":"IF(GORLIS!I137=\"\",\"\",+GORLIS!I137)","v":""},{"$f":"IF(GORLIS!J137=\"\",\"\",+GORLIS!J137)","v":""},null,null,{"$f":"IF(GORLIS!M137=\"\",\"\",+GORLIS!M137)","v":""},null,{"$f":"IF(GORLIS!O137=\"\",\"\",+GORLIS!O137)","v":""},{"$f":"IF(GORLIS!P137=\"\",\"\",+GORLIS!P137)","v":""},{"$f":"IF(GORLIS!Q137=\"\",\"\",+GORLIS!Q137)","v":""},{"$f":"IF(GORLIS!R137=\"\",\"\",+GORLIS!R137)","v":""},{"$f":"IF(J136=\"\",\"\",CONCATENATE(GORLIS!T137,\"--\",J136))","v":""},null,null,0,null,0,null,{"$f":"IF(GORLIS!S137=\"\",\"\",+GORLIS!S137)","v":""}]
[null,{"$f":"IF(GORLIS!B138=\"\",\"\",B136+1)","v":""},{"$f":"IF(GORLIS!B138=\"\",\"\",+GORLIS!B138)","v":""},{"$f":"IF(GORLIS!C138=\"\",\"\",+GORLIS!C138)","v":""},{"$f":"IF(GORLIS!D138=\"\",\"\",+GORLIS!D138)","v":""},{"$f":"IF(GORLIS!E138=\"\",\"\",+GORLIS!E138)","v":""},{"$f":"IF(GORLIS!F138=\"\",\"\",+GORLIS!F138)","v":""},{"$f":"IF(GORLIS!G138=\"\",\"\",+GORLIS!G138)","v":""},{"$f":"IF(GORLIS!H138=\"\",\"\",+GORLIS!H138)","v":""},{"$f":"IF(GORLIS!I138=\"\",\"\",+GORLIS!I138)","v":""},{"$f":"IF(GORLIS!J138=\"\",\"\",+GORLIS!J138)","v":""},null,null,{"$f":"IF(GORLIS!M138=\"\",\"\",+GORLIS!M138)","v":""},null,{"$f":"IF(GORLIS!O138=\"\",\"\",+GORLIS!O138)","v":""},{"$f":"IF(GORLIS!P138=\"\",\"\",+GORLIS!P138)","v":""},{"$f":"IF(GORLIS!Q138=\"\",\"\",+GORLIS!Q138)","v":""},{"$f":"IF(GORLIS!R138=\"\",\"\",+GORLIS!R138)","v":""},{"$f":"IF(J137=\"\",\"\",CONCATENATE(GORLIS!T138,\"--\",J137))","v":""},null,null,0,null,0,null,{"$f":"IF(GORLIS!S138=\"\",\"\",+GORLIS!S138)","v":""}]
[null,{"$f":"IF(GORLIS!B139=\"\",\"\",B137+1)","v":""},{"$f":"IF(GORLIS!B139=\"\",\"\",+GORLIS!B139)","v":""},{"$f":"IF(GORLIS!C139=\"\",\"\",+GORLIS!C139)","v":""},{"$f":"IF(GORLIS!D139=\"\",\"\",+GORLIS!D139)","v":""},{"$f":"IF(GORLIS!E139=\"\",\"\",+GORLIS!E139)","v":""},{"$f":"IF(GORLIS!F139=\"\",\"\",+GORLIS!F139)","v":""},{"$f":"IF(GORLIS!G139=\"\",\"\",+GORLIS!G139)","v":""},{"$f":"IF(GORLIS!H139=\"\",\"\",+GORLIS!H139)","v":""},{"$f":"IF(GORLIS!I139=\"\",\"\",+GORLIS!I139)","v":""},{"$f":"IF(GORLIS!J139=\"\",\"\",+GORLIS!J139)","v":""},null,null,{"$f":"IF(GORLIS!M139=\"\",\"\",+GORLIS!M139)","v":""},null,{"$f":"IF(GORLIS!O139=\"\",\"\",+GORLIS!O139)","v":""},{"$f":"IF(GORLIS!P139=\"\",\"\",+GORLIS!P139)","v":""},{"$f":"IF(GORLIS!Q139=\"\",\"\",+GORLIS!Q139)","v":""},{"$f":"IF(GORLIS!R139=\"\",\"\",+GORLIS!R139)","v":""},{"$f":"IF(J138=\"\",\"\",CONCATENATE(GORLIS!T139,\"--\",J138))","v":""},null,null,0,null,0,null,{"$f":"IF(GORLIS!S139=\"\",\"\",+GORLIS!S139)","v":""}]
[null,{"$f":"IF(GORLIS!B140=\"\",\"\",B138+1)","v":""},{"$f":"IF(GORLIS!B140=\"\",\"\",+GORLIS!B140)","v":""},{"$f":"IF(GORLIS!C140=\"\",\"\",+GORLIS!C140)","v":""},{"$f":"IF(GORLIS!D140=\"\",\"\",+GORLIS!D140)","v":""},{"$f":"IF(GORLIS!E140=\"\",\"\",+GORLIS!E140)","v":""},{"$f":"IF(GORLIS!F140=\"\",\"\",+GORLIS!F140)","v":""},{"$f":"IF(GORLIS!G140=\"\",\"\",+GORLIS!G140)","v":""},{"$f":"IF(GORLIS!H140=\"\",\"\",+GORLIS!H140)","v":""},{"$f":"IF(GORLIS!I140=\"\",\"\",+GORLIS!I140)","v":""},{"$f":"IF(GORLIS!J140=\"\",\"\",+GORLIS!J140)","v":""},null,null,{"$f":"IF(GORLIS!M140=\"\",\"\",+GORLIS!M140)","v":""},null,{"$f":"IF(GORLIS!O140=\"\",\"\",+GORLIS!O140)","v":""},{"$f":"IF(GORLIS!P140=\"\",\"\",+GORLIS!P140)","v":""},{"$f":"IF(GORLIS!Q140=\"\",\"\",+GORLIS!Q140)","v":""},{"$f":"IF(GORLIS!R140=\"\",\"\",+GORLIS!R140)","v":""},{"$f":"IF(J139=\"\",\"\",CONCATENATE(GORLIS!T140,\"--\",J139))","v":""},null,null,0,null,0,null,{"$f":"IF(GORLIS!S140=\"\",\"\",+GORLIS!S140)","v":""}]
[null,{"$f":"IF(GORLIS!B141=\"\",\"\",B139+1)","v":""},{"$f":"IF(GORLIS!B141=\"\",\"\",+GORLIS!B141)","v":""},{"$f":"IF(GORLIS!C141=\"\",\"\",+GORLIS!C141)","v":""},{"$f":"IF(GORLIS!D141=\"\",\"\",+GORLIS!D141)","v":""},{"$f":"IF(GORLIS!E141=\"\",\"\",+GORLIS!E141)","v":""},{"$f":"IF(GORLIS!F141=\"\",\"\",+GORLIS!F141)","v":""},{"$f":"IF(GORLIS!G141=\"\",\"\",+GORLIS!G141)","v":""},{"$f":"IF(GORLIS!H141=\"\",\"\",+GORLIS!H141)","v":""},{"$f":"IF(GORLIS!I141=\"\",\"\",+GORLIS!I141)","v":""},{"$f":"IF(GORLIS!J141=\"\",\"\",+GORLIS!J141)","v":""},null,null,{"$f":"IF(GORLIS!M141=\"\",\"\",+GORLIS!M141)","v":""},null,{"$f":"IF(GORLIS!O141=\"\",\"\",+GORLIS!O141)","v":""},{"$f":"IF(GORLIS!P141=\"\",\"\",+GORLIS!P141)","v":""},{"$f":"IF(GORLIS!Q141=\"\",\"\",+GORLIS!Q141)","v":""},{"$f":"IF(GORLIS!R141=\"\",\"\",+GORLIS!R141)","v":""},{"$f":"IF(J140=\"\",\"\",CONCATENATE(GORLIS!T141,\"--\",J140))","v":""},null,null,0,null,0,null,{"$f":"IF(GORLIS!S141=\"\",\"\",+GORLIS!S141)","v":""}]
[null,{"$f":"IF(GORLIS!B142=\"\",\"\",B140+1)","v":""},{"$f":"IF(GORLIS!B142=\"\",\"\",+GORLIS!B142)","v":""},{"$f":"IF(GORLIS!C142=\"\",\"\",+GORLIS!C142)","v":""},{"$f":"IF(GORLIS!D142=\"\",\"\",+GORLIS!D142)","v":""},{"$f":"IF(GORLIS!E142=\"\",\"\",+GORLIS!E142)","v":""},{"$f":"IF(GORLIS!F142=\"\",\"\",+GORLIS!F142)","v":""},{"$f":"IF(GORLIS!G142=\"\",\"\",+GORLIS!G142)","v":""},{"$f":"IF(GORLIS!H142=\"\",\"\",+GORLIS!H142)","v":""},{"$f":"IF(GORLIS!I142=\"\",\"\",+GORLIS!I142)","v":""},{"$f":"IF(GORLIS!J142=\"\",\"\",+GORLIS!J142)","v":""},null,null,{"$f":"IF(GORLIS!M142=\"\",\"\",+GORLIS!M142)","v":""},null,{"$f":"IF(GORLIS!O142=\"\",\"\",+GORLIS!O142)","v":""},{"$f":"IF(GORLIS!P142=\"\",\"\",+GORLIS!P142)","v":""},{"$f":"IF(GORLIS!Q142=\"\",\"\",+GORLIS!Q142)","v":""},{"$f":"IF(GORLIS!R142=\"\",\"\",+GORLIS!R142)","v":""},{"$f":"IF(J141=\"\",\"\",CONCATENATE(GORLIS!T142,\"--\",J141))","v":""},null,null,0,null,0,null,{"$f":"IF(GORLIS!S142=\"\",\"\",+GORLIS!S142)","v":""}]
[null,{"$f":"IF(GORLIS!B143=\"\",\"\",B141+1)","v":""},{"$f":"IF(GORLIS!B143=\"\",\"\",+GORLIS!B143)","v":""},{"$f":"IF(GORLIS!C143=\"\",\"\",+GORLIS!C143)","v":""},{"$f":"IF(GORLIS!D143=\"\",\"\",+GORLIS!D143)","v":""},{"$f":"IF(GORLIS!E143=\"\",\"\",+GORLIS!E143)","v":""},{"$f":"IF(GORLIS!F143=\"\",\"\",+GORLIS!F143)","v":""},{"$f":"IF(GORLIS!G143=\"\",\"\",+GORLIS!G143)","v":""},{"$f":"IF(GORLIS!H143=\"\",\"\",+GORLIS!H143)","v":""},{"$f":"IF(GORLIS!I143=\"\",\"\",+GORLIS!I143)","v":""},{"$f":"IF(GORLIS!J143=\"\",\"\",+GORLIS!J143)","v":""},null,null,{"$f":"IF(GORLIS!M143=\"\",\"\",+GORLIS!M143)","v":""},null,{"$f":"IF(GORLIS!O143=\"\",\"\",+GORLIS!O143)","v":""},{"$f":"IF(GORLIS!P143=\"\",\"\",+GORLIS!P143)","v":""},{"$f":"IF(GORLIS!Q143=\"\",\"\",+GORLIS!Q143)","v":""},{"$f":"IF(GORLIS!R143=\"\",\"\",+GORLIS!R143)","v":""},{"$f":"IF(J142=\"\",\"\",CONCATENATE(GORLIS!T143,\"--\",J142))","v":""},null,null,0,null,0,null,{"$f":"IF(GORLIS!S143=\"\",\"\",+GORLIS!S143)","v":""}]
[null,{"$f":"IF(GORLIS!B144=\"\",\"\",B142+1)","v":""},{"$f":"IF(GORLIS!B144=\"\",\"\",+GORLIS!B144)","v":""},{"$f":"IF(GORLIS!C144=\"\",\"\",+GORLIS!C144)","v":""},{"$f":"IF(GORLIS!D144=\"\",\"\",+GORLIS!D144)","v":""},{"$f":"IF(GORLIS!E144=\"\",\"\",+GORLIS!E144)","v":""},{"$f":"IF(GORLIS!F144=\"\",\"\",+GORLIS!F144)","v":""},{"$f":"IF(GORLIS!G144=\"\",\"\",+GORLIS!G144)","v":""},{"$f":"IF(GORLIS!H144=\"\",\"\",+GORLIS!H144)","v":""},{"$f":"IF(GORLIS!I144=\"\",\"\",+GORLIS!I144)","v":""},{"$f":"IF(GORLIS!J144=\"\",\"\",+GORLIS!J144)","v":""},null,null,{"$f":"IF(GORLIS!M144=\"\",\"\",+GORLIS!M144)","v":""},null,{"$f":"IF(GORLIS!O144=\"\",\"\",+GORLIS!O144)","v":""},{"$f":"IF(GORLIS!P144=\"\",\"\",+GORLIS!P144)","v":""},{"$f":"IF(GORLIS!Q144=\"\",\"\",+GORLIS!Q144)","v":""},{"$f":"IF(GORLIS!R144=\"\",\"\",+GORLIS!R144)","v":""},{"$f":"IF(J143=\"\",\"\",CONCATENATE(GORLIS!T144,\"--\",J143))","v":""},null,null,0,null,0,null,{"$f":"IF(GORLIS!S144=\"\",\"\",+GORLIS!S144)","v":""}]
[null,{"$f":"IF(GORLIS!B145=\"\",\"\",B143+1)","v":""},{"$f":"IF(GORLIS!B145=\"\",\"\",+GORLIS!B145)","v":""},{"$f":"IF(GORLIS!C145=\"\",\"\",+GORLIS!C145)","v":""},{"$f":"IF(GORLIS!D145=\"\",\"\",+GORLIS!D145)","v":""},{"$f":"IF(GORLIS!E145=\"\",\"\",+GORLIS!E145)","v":""},{"$f":"IF(GORLIS!F145=\"\",\"\",+GORLIS!F145)","v":""},{"$f":"IF(GORLIS!G145=\"\",\"\",+GORLIS!G145)","v":""},{"$f":"IF(GORLIS!H145=\"\",\"\",+GORLIS!H145)","v":""},{"$f":"IF(GORLIS!I145=\"\",\"\",+GORLIS!I145)","v":""},{"$f":"IF(GORLIS!J145=\"\",\"\",+GORLIS!J145)","v":""},null,null,{"$f":"IF(GORLIS!M145=\"\",\"\",+GORLIS!M145)","v":""},null,{"$f":"IF(GORLIS!O145=\"\",\"\",+GORLIS!O145)","v":""},{"$f":"IF(GORLIS!P145=\"\",\"\",+GORLIS!P145)","v":""},{"$f":"IF(GORLIS!Q145=\"\",\"\",+GORLIS!Q145)","v":""},{"$f":"IF(GORLIS!R145=\"\",\"\",+GORLIS!R145)","v":""},{"$f":"IF(J144=\"\",\"\",CONCATENATE(GORLIS!T145,\"--\",J144))","v":""},null,null,0,null,0,null,{"$f":"IF(GORLIS!S145=\"\",\"\",+GORLIS!S145)","v":""}]
[null,{"$f":"IF(GORLIS!B146=\"\",\"\",B144+1)","v":""},{"$f":"IF(GORLIS!B146=\"\",\"\",+GORLIS!B146)","v":""},{"$f":"IF(GORLIS!C146=\"\",\"\",+GORLIS!C146)","v":""},{"$f":"IF(GORLIS!D146=\"\",\"\",+GORLIS!D146)","v":""},{"$f":"IF(GORLIS!E146=\"\",\"\",+GORLIS!E146)","v":""},{"$f":"IF(GORLIS!F146=\"\",\"\",+GORLIS!F146)","v":""},{"$f":"IF(GORLIS!G146=\"\",\"\",+GORLIS!G146)","v":""},{"$f":"IF(GORLIS!H146=\"\",\"\",+GORLIS!H146)","v":""},{"$f":"IF(GORLIS!I146=\"\",\"\",+GORLIS!I146)","v":""},{"$f":"IF(GORLIS!J146=\"\",\"\",+GORLIS!J146)","v":""},null,null,{"$f":"IF(GORLIS!M146=\"\",\"\",+GORLIS!M146)","v":""},null,{"$f":"IF(GORLIS!O146=\"\",\"\",+GORLIS!O146)","v":""},{"$f":"IF(GORLIS!P146=\"\",\"\",+GORLIS!P146)","v":""},{"$f":"IF(GORLIS!Q146=\"\",\"\",+GORLIS!Q146)","v":""},{"$f":"IF(GORLIS!R146=\"\",\"\",+GORLIS!R146)","v":""},{"$f":"IF(J145=\"\",\"\",CONCATENATE(GORLIS!T146,\"--\",J145))","v":""},null,null,0,null,0,null,{"$f":"IF(GORLIS!S146=\"\",\"\",+GORLIS!S146)","v":""}]
[null,{"$f":"IF(GORLIS!B147=\"\",\"\",B145+1)","v":""},{"$f":"IF(GORLIS!B147=\"\",\"\",+GORLIS!B147)","v":""},{"$f":"IF(GORLIS!C147=\"\",\"\",+GORLIS!C147)","v":""},{"$f":"IF(GORLIS!D147=\"\",\"\",+GORLIS!D147)","v":""},{"$f":"IF(GORLIS!E147=\"\",\"\",+GORLIS!E147)","v":""},{"$f":"IF(GORLIS!F147=\"\",\"\",+GORLIS!F147)","v":""},{"$f":"IF(GORLIS!G147=\"\",\"\",+GORLIS!G147)","v":""},{"$f":"IF(GORLIS!H147=\"\",\"\",+GORLIS!H147)","v":""},{"$f":"IF(GORLIS!I147=\"\",\"\",+GORLIS!I147)","v":""},{"$f":"IF(GORLIS!J147=\"\",\"\",+GORLIS!J147)","v":""},null,null,{"$f":"IF(GORLIS!M147=\"\",\"\",+GORLIS!M147)","v":""},null,{"$f":"IF(GORLIS!O147=\"\",\"\",+GORLIS!O147)","v":""},{"$f":"IF(GORLIS!P147=\"\",\"\",+GORLIS!P147)","v":""},{"$f":"IF(GORLIS!Q147=\"\",\"\",+GORLIS!Q147)","v":""},{"$f":"IF(GORLIS!R147=\"\",\"\",+GORLIS!R147)","v":""},{"$f":"IF(J146=\"\",\"\",CONCATENATE(GORLIS!T147,\"--\",J146))","v":""},null,null,0,null,0,null,{"$f":"IF(GORLIS!S147=\"\",\"\",+GORLIS!S147)","v":""}]
[null,{"$f":"IF(GORLIS!B148=\"\",\"\",B146+1)","v":""},{"$f":"IF(GORLIS!B148=\"\",\"\",+GORLIS!B148)","v":""},{"$f":"IF(GORLIS!C148=\"\",\"\",+GORLIS!C148)","v":""},{"$f":"IF(GORLIS!D148=\"\",\"\",+GORLIS!D148)","v":""},{"$f":"IF(GORLIS!E148=\"\",\"\",+GORLIS!E148)","v":""},{"$f":"IF(GORLIS!F148=\"\",\"\",+GORLIS!F148)","v":""},{"$f":"IF(GORLIS!G148=\"\",\"\",+GORLIS!G148)","v":""},{"$f":"IF(GORLIS!H148=\"\",\"\",+GORLIS!H148)","v":""},{"$f":"IF(GORLIS!I148=\"\",\"\",+GORLIS!I148)","v":""},{"$f":"IF(GORLIS!J148=\"\",\"\",+GORLIS!J148)","v":""},null,null,{"$f":"IF(GORLIS!M148=\"\",\"\",+GORLIS!M148)","v":""},null,{"$f":"IF(GORLIS!O148=\"\",\"\",+GORLIS!O148)","v":""},{"$f":"IF(GORLIS!P148=\"\",\"\",+GORLIS!P148)","v":""},{"$f":"IF(GORLIS!Q148=\"\",\"\",+GORLIS!Q148)","v":""},{"$f":"IF(GORLIS!R148=\"\",\"\",+GORLIS!R148)","v":""},{"$f":"IF(J147=\"\",\"\",CONCATENATE(GORLIS!T148,\"--\",J147))","v":""},null,null,0,null,0,null,{"$f":"IF(GORLIS!S148=\"\",\"\",+GORLIS!S148)","v":""}]
[null,{"$f":"IF(GORLIS!B149=\"\",\"\",B147+1)","v":""},{"$f":"IF(GORLIS!B149=\"\",\"\",+GORLIS!B149)","v":""},{"$f":"IF(GORLIS!C149=\"\",\"\",+GORLIS!C149)","v":""},{"$f":"IF(GORLIS!D149=\"\",\"\",+GORLIS!D149)","v":""},{"$f":"IF(GORLIS!E149=\"\",\"\",+GORLIS!E149)","v":""},{"$f":"IF(GORLIS!F149=\"\",\"\",+GORLIS!F149)","v":""},{"$f":"IF(GORLIS!G149=\"\",\"\",+GORLIS!G149)","v":""},{"$f":"IF(GORLIS!H149=\"\",\"\",+GORLIS!H149)","v":""},{"$f":"IF(GORLIS!I149=\"\",\"\",+GORLIS!I149)","v":""},{"$f":"IF(GORLIS!J149=\"\",\"\",+GORLIS!J149)","v":""},null,null,{"$f":"IF(GORLIS!M149=\"\",\"\",+GORLIS!M149)","v":""},null,{"$f":"IF(GORLIS!O149=\"\",\"\",+GORLIS!O149)","v":""},{"$f":"IF(GORLIS!P149=\"\",\"\",+GORLIS!P149)","v":""},{"$f":"IF(GORLIS!Q149=\"\",\"\",+GORLIS!Q149)","v":""},{"$f":"IF(GORLIS!R149=\"\",\"\",+GORLIS!R149)","v":""},{"$f":"IF(J148=\"\",\"\",CONCATENATE(GORLIS!T149,\"--\",J148))","v":""},null,null,0,null,0,null,{"$f":"IF(GORLIS!S149=\"\",\"\",+GORLIS!S149)","v":""}]

{"sheet":"Yolluk Bildirimi","index":4,"n_rows":47,"n_cols":25,"rows_kept":47,"cut":false,"hidden":false,"merged":[[11,21,11,22],[10,10,10,15],[13,14,14,15],[14,21,14,22],[15,20,16,20],[13,11,13,13],[18,1,38,1],[40,21,40,22],[40,16,40,17],[12,3,17,3],[14,12,17,12],[13,10,17,10],[13,8,17,9],[44,8,45,10],[40,8,40,11],[40,12,40,13],[14,11,17,11],[13,16,14,17],[13,18,14,19]]}
[]
[]
[]
[]
[]
[]
[]
[]
[]
[null,null,null,null,null,null," ",null,"ADI SOYADI",{"$f":"IF(ISERROR(VLOOKUP($D$19,'Bildirim İçin'!$B$3:$R$90,3,FALSE)),0,(VLOOKUP($D$19,'Bildirim İçin'!$B$3:$R$90,3,FALSE)))","v":"dkdkdk"}]
[null,null,null,null,null,null," ",null,"UNVANI",{"$f":"IF(ISERROR(VLOOKUP($D$19,'Bildirim İçin'!$B$3:$R$90,4,FALSE)),0,(VLOOKUP($D$19,'Bildirim İçin'!$B$3:$R$90,4,FALSE)))","v":"dsjasoj"},"YURTİÇİ GEÇİCİ GÖREV YOLLUĞU BİLDİRİMİ",null,null,null,null,null,null,null,null,null," "," "]
[null,null,null,null,null,null,null,null,"DERECESI",{"$f":"IF(ISERROR(VLOOKUP($D$19,'Bildirim İçin'!$B$3:$R$90,5,FALSE)),0,(VLOOKUP($D$19,'Bildirim İçin'!$B$3:$R$90,5,FALSE)))","v":""},{"$f":"IF(ISERROR(VLOOKUP($D$19,'Bildirim İçin'!$B$3:$AA$90,26,FALSE)),0,(VLOOKUP($D$19,'Bildirim İçin'!$B$3:$AA$90,26,FALSE)))","v":""},null,null,null," "," ",null,null,null,null," DAIRESI               :",{"$f":"+'BİLGİ GİRİŞİ'!E12","v":0},null,null," "]
[null,null,null,"Bildirim İçin Hazırlanan Sayfadaki Sıra Nosunu Girininiz",null,null,null,null,"GUNDELIĞİ",{"$f":"IF(ISERROR(VLOOKUP($D$19,'Bildirim İçin'!$B$3:$R$90,6,FALSE)),0,(VLOOKUP($D$19,'Bildirim İçin'!$B$3:$R$90,6,FALSE)))","v":0},null,null,null,null,null,"(TL.-)",null,null,null,null,"BUTCE YILI          :",null,{"$f":"YEAR('BİLGİ GİRİŞİ'!A9)","v":2021},null,"  "]
[null,null,null,null,null,null,null,null,"OTURMA VE YOLCULULUK TARIHLERİ",null,"ALACAKLININ NEREDEN NEREYE YOLCULUK ETTIGI VEYA NEREDE OTURDUGU","Yolculuk  ve Oturma Gündelikleri",null,null," Y O L GİDERLERİ",null,"Konaklama Gideri",null,"Şehir İçi Ulaşım"]
[null,null,null,null,null,null,null,null,null,null,null,"Gün Sayısı","   Bıir Günlük Yevmiye"," ",null,null,null,null,null,null,null,"HAREKET  SAATLERI"]
[null,null,null,null,null,null,null,null,null,null,null,null,null,null,null,null,null,null,null,null,"GENEL  TOPLAM"," "," "]
[null,null,null,null,null,null,null,null,null,null,null,null,null," TUTARI","CESIDI","  TUTARI","Gün Sayısı","  TUTARI","Çeşidi","  TUTARI",null,"GIDIS","DONUS"]
[null,null,null,null,null,null,null,null,null,null,null,null,null,1," ",2," ",3," ",4,"1+2+3+4"," "," "]
[null,"DÖKÜMÜ ALINACAK KAYIT NO :",null,1,null," ",null,null,{"$f":"IF(ISERROR(VLOOKUP(D19,'Bildirim İçin'!$B$3:$R$90,10,FALSE)),0,(VLOOKUP(D19,'Bildirim İçin'!$B$3:$R$90,10,FALSE)))","v":"00:00:00"},{"$f":"IF(ISERROR(VLOOKUP(D19,'Bildirim İçin'!$B$3:$R$90,11,FALSE)),0,(VLOOKUP(D19,'Bildirim İçin'!$B$3:$R$90,11,FALSE)))","v":"00:00:00"},{"$f":"IF(ISERROR(VLOOKUP(D19,'Bildirim İçin'!$B$3:$T$90,19,FALSE)),0,(VLOOKUP(D19,'Bildirim İçin'!$B$3:$T$90,19,FALSE)))","v":"0--0"},{"$f":"IF(ISERROR(VLOOKUP(D19,'Bildirim İçin'!$B$3:$R$90,12,FALSE)),0,(VLOOKUP(D19,'Bildirim İçin'!$B$3:$R$90,12,FALSE)))","v":0},{"$f":"IF(ISERROR(VLOOKUP(D19,'Bildirim İçin'!$B$3:$R$90,6,FALSE)),0,(VLOOKUP(D19,'Bildirim İçin'!$B$3:$R$90,6,FALSE)))","v":0},{"$f":"IF(L19=\" \",\" \",ROUND((L19*M19),2))","v":0},{"$f":"IF(ISERROR(VLOOKUP(D19,'Bildirim İçin'!$B$3:$R$90,15,FALSE)),0,(VLOOKUP(D19,'Bildirim İçin'!$B$3:$R$90,15,FALSE)))","v":0},{"$f":"IF(ISERROR(VLOOKUP(D19,'Bildirim İçin'!$B$3:$T$90,18,FALSE)),0,(VLOOKUP(D19,'Bildirim İçin'!$B$3:$T$90,18,FALSE)))","v":0},{"$f":"IF(ISERROR(VLOOKUP(D19,'Bildirim İçin'!$B$3:$Y$90,22,FALSE)),0,(VLOOKUP(D19,'Bildirim İçin'!$B$3:$Y$90,22,FALSE)))","v":0},{"$f":"IF(ISERROR(VLOOKUP(D19,'Bildirim İçin'!$B$3:$Y$90,24,FALSE)),0,(VLOOKUP(D19,'Bildirim İçin'!$B$3:$Y$90,24,FALSE)))","v":0},{"$f":"IF(T19>0,\"Taksi\",0)","v":0},{"$f":"IF(ISERROR(VLOOKUP(D19,'Bildirim İçin'!$B$3:$Z$90,25,FALSE)),0,(VLOOKUP(D19,'Bildirim İçin'!$B$3:$Z$90,25,FALSE)))","v":0},{"$f":"SUM(N19+P19+R19+T19)","v":0},{"$f":"IF(ISERROR(VLOOKUP(D19,'Bildirim İçin'!$B$3:$R$90,13,FALSE)),0,(VLOOKUP(D19,'Bildirim İçin'!$B$3:$R$90,13,FALSE)))","v":"00:00:00"},{"$f":"IF(ISERROR(VLOOKUP(D19,'Bildirim İçin'!$B$3:$R$90,14,FALSE)),0,(VLOOKUP(D19,'Bildirim İçin'!$B$3:$R$90,14,FALSE)))","v":"00:00:00"}]
[null,null,null,2,null,null,null,null,{"$f":"IF(ISERROR(VLOOKUP(D20,'Bildirim İçin'!$B$3:$R$90,10,FALSE)),0,(VLOOKUP(D20,'Bildirim İçin'!$B$3:$R$90,10,FALSE)))","v":"00:00:00"},{"$f":"IF(ISERROR(VLOOKUP(D20,'Bildirim İçin'!$B$3:$R$90,11,FALSE)),0,(VLOOKUP(D20,'Bildirim İçin'!$B$3:$R$90,11,FALSE)))","v":"00:00:00"},{"$f":"IF(ISERROR(VLOOKUP(D20,'Bildirim İçin'!$B$3:$T$90,19,FALSE)),0,(VLOOKUP(D20,'Bildirim İçin'!$B$3:$T$90,19,FALSE)))","v":"0--0"},{"$f":"IF(ISERROR(VLOOKUP(D20,'Bildirim İçin'!$B$3:$R$90,12,FALSE)),0,(VLOOKUP(D20,'Bildirim İçin'!$B$3:$R$90,12,FALSE)))","v":0},{"$f":"IF(ISERROR(VLOOKUP(D20,'Bildirim İçin'!$B$3:$R$90,6,FALSE)),0,(VLOOKUP(D20,'Bildirim İçin'!$B$3:$R$90,6,FALSE)))","v":0},{"$f":"IF(L20=\" \",\" \",ROUND((L20*M20),2))","v":0},{"$f":"IF(ISERROR(VLOOKUP(D20,'Bildirim İçin'!$B$3:$R$90,15,FALSE)),0,(VLOOKUP(D20,'Bildirim İçin'!$B$3:$R$90,15,FALSE)))","v":0},{"$f":"IF(ISERROR(VLOOKUP(D20,'Bildirim İçin'!$B$3:$T$90,18,FALSE)),0,(VLOOKUP(D20,'Bildirim İçin'!$B$3:$T$90,18,FALSE)))","v":0},{"$f":"IF(ISERROR(VLOOKUP(D20,'Bildirim İçin'!$B$3:$Y$90,22,FALSE)),0,(VLOOKUP(D20,'Bildirim İçin'!$B$3:$Y$90,22,FALSE)))","v":0},{"$f":"IF(ISERROR(VLOOKUP(D20,'Bildirim İçin'!$B$3:$Y$90,24,FALSE)),0,(VLOOKUP(D20,'Bildirim İçin'!$B$3:$Y$90,24,FALSE)))","v":0},{"$f":"IF(T20>0,\"Taksi\",0)","v":0},{"$f":"IF(ISERROR(VLOOKUP(D20,'Bildirim İçin'!$B$3:$Z$90,25,FALSE)),0,(VLOOKUP(D20,'Bildirim İçin'!$B$3:$Z$90,25,FALSE)))","v":0},{"$f":"SUM(N20+P20+R20+T20)","v":0},{"$f":"IF(ISERROR(VLOOKUP(D20,'Bildirim İçin'!$B$3:$R$90,13,FALSE)),0,(VLOOKUP(D20,'Bildirim İçin'!$B$3:$R$90,13,FALSE)))","v":"00:00:00"},{"$f":"IF(ISERROR(VLOOKUP(D20,'Bildirim İçin'!$B$3:$R$90,14,FALSE)),0,(VLOOKUP(D20,'Bildirim İçin'!$B$3:$R$90,14,FALSE)))","v":"00:00:00"}]
[null,null,null,null,null,null,null,null,{"$f":"IF(ISERROR(VLOOKUP(D21,'Bildirim İçin'!$B$3:$R$90,10,FALSE)),0,(VLOOKUP(D21,'Bildirim İçin'!$B$3:$R$90,10,FALSE)))","v":"00:00:00"},{"$f":"IF(ISERROR(VLOOKUP(D21,'Bildirim İçin'!$B$3:$R$90,11,FALSE)),0,(VLOOKUP(D21,'Bildirim İçin'!$B$3:$R$90,11,FALSE)))","v":"00:00:00"},{"$f":"IF(ISERROR(VLOOKUP(D21,'Bildirim İçin'!$B$3:$T$90,19,FALSE)),0,(VLOOKUP(D21,'Bildirim İçin'!$B$3:$T$90,19,FALSE)))","v":0},{"$f":"IF(ISERROR(VLOOKUP(D21,'Bildirim İçin'!$B$3:$R$90,12,FALSE)),0,(VLOOKUP(D21,'Bildirim İçin'!$B$3:$R$90,12,FALSE)))","v":0},{"$f":"IF(ISERROR(VLOOKUP(D21,'Bildirim İçin'!$B$3:$R$90,6,FALSE)),0,(VLOOKUP(D21,'Bildirim İçin'!$B$3:$R$90,6,FALSE)))","v":0},0,{"$f":"IF(ISERROR(VLOOKUP(D21,'Bildirim İçin'!$B$3:$R$90,15,FALSE)),0,(VLOOKUP(D21,'Bildirim İçin'!$B$3:$R$90,15,FALSE)))","v":0},{"$f":"IF(ISERROR(VLOOKUP(D21,'Bildirim İçin'!$B$3:$T$90,18,FALSE)),0,(VLOOKUP(D21,'Bildirim İçin'!$B$3:$T$90,18,FALSE)))","v":0},{"$f":"IF(ISERROR(VLOOKUP(D21,'Bildirim İçin'!$B$3:$Y$90,22,FALSE)),0,(VLOOKUP(D21,'Bildirim İçin'!$B$3:$Y$90,22,FALSE)))","v":0},{"$f":"IF(ISERROR(VLOOKUP(D21,'Bildirim İçin'!$B$3:$Y$90,24,FALSE)),0,(VLOOKUP(D21,'Bildirim İçin'!$B$3:$Y$90,24,FALSE)))","v":0},0,{"$f":"IF(ISERROR(VLOOKUP(D21,'Bildirim İçin'!$B$3:$Z$90,25,FALSE)),0,(VLOOKUP(D21,'Bildirim İçin'!$B$3:$Z$90,25,FALSE)))","v":0},0,{"$f":"IF(ISERROR(VLOOKUP(D21,'Bildirim İçin'!$B$3:$R$90,13,FALSE)),0,(VLOOKUP(D21,'Bildirim İçin'!$B$3:$R$90,13,FALSE)))","v":"00:00:00"},{"$f":"IF(ISERROR(VLOOKUP(D21,'Bildirim İçin'!$B$3:$R$90,14,FALSE)),0,(VLOOKUP(D21,'Bildirim İçin'!$B$3:$R$90,14,FALSE)))","v":"00:00:00"}]
[null,null,null,null,null," ",null,null,{"$f":"IF(ISERROR(VLOOKUP(D22,'Bildirim İçin'!$B$3:$R$90,10,FALSE)),0,(VLOOKUP(D22,'Bildirim İçin'!$B$3:$R$90,10,FALSE)))","v":"00:00:00"},{"$f":"IF(ISERROR(VLOOKUP(D22,'Bildirim İçin'!$B$3:$R$90,11,FALSE)),0,(VLOOKUP(D22,'Bildirim İçin'!$B$3:$R$90,11,FALSE)))","v":"00:00:00"},{"$f":"IF(ISERROR(VLOOKUP(D22,'Bildirim İçin'!$B$3:$T$90,19,FALSE)),0,(VLOOKUP(D22,'Bildirim İçin'!$B$3:$T$90,19,FALSE)))","v":0},{"$f":"IF(ISERROR(VLOOKUP(D22,'Bildirim İçin'!$B$3:$R$90,12,FALSE)),0,(VLOOKUP(D22,'Bildirim İçin'!$B$3:$R$90,12,FALSE)))","v":0},{"$f":"IF(ISERROR(VLOOKUP(D22,'Bildirim İçin'!$B$3:$R$90,6,FALSE)),0,(VLOOKUP(D22,'Bildirim İçin'!$B$3:$R$90,6,FALSE)))","v":0},0,{"$f":"IF(ISERROR(VLOOKUP(D22,'Bildirim İçin'!$B$3:$R$90,15,FALSE)),0,(VLOOKUP(D22,'Bildirim İçin'!$B$3:$R$90,15,FALSE)))","v":0},{"$f":"IF(ISERROR(VLOOKUP(D22,'Bildirim İçin'!$B$3:$T$90,18,FALSE)),0,(VLOOKUP(D22,'Bildirim İçin'!$B$3:$T$90,18,FALSE)))","v":0},{"$f":"IF(ISERROR(VLOOKUP(D22,'Bildirim İçin'!$B$3:$Y$90,22,FALSE)),0,(VLOOKUP(D22,'Bildirim İçin'!$B$3:$Y$90,22,FALSE)))","v":0},{"$f":"IF(ISERROR(VLOOKUP(D22,'Bildirim İçin'!$B$3:$Y$90,24,FALSE)),0,(VLOOKUP(D22,'Bildirim İçin'!$B$3:$Y$90,24,FALSE)))","v":0},0,{"$f":"IF(ISERROR(VLOOKUP(D22,'Bildirim İçin'!$B$3:$Z$90,25,FALSE)),0,(VLOOKUP(D22,'Bildirim İçin'!$B$3:$Z$90,25,FALSE)))","v":0},0,{"$f":"IF(ISERROR(VLOOKUP(D22,'Bildirim İçin'!$B$3:$R$90,13,FALSE)),0,(VLOOKUP(D22,'Bildirim İçin'!$B$3:$R$90,13,FALSE)))","v":"00:00:00"},{"$f":"IF(ISERROR(VLOOKUP(D22,'Bildirim İçin'!$B$3:$R$90,14,FALSE)),0,(VLOOKUP(D22,'Bildirim İçin'!$B$3:$R$90,14,FALSE)))","v":"00:00:00"}]
[null,null,null,null,null,null,null,null,{"$f":"IF(ISERROR(VLOOKUP(D23,'Bildirim İçin'!$B$3:$R$90,10,FALSE)),0,(VLOOKUP(D23,'Bildirim İçin'!$B$3:$R$90,10,FALSE)))","v":"00:00:00"},{"$f":"IF(ISERROR(VLOOKUP(D23,'Bildirim İçin'!$B$3:$R$90,11,FALSE)),0,(VLOOKUP(D23,'Bildirim İçin'!$B$3:$R$90,11,FALSE)))","v":"00:00:00"},{"$f":"IF(ISERROR(VLOOKUP(D23,'Bildirim İçin'!$B$3:$T$90,19,FALSE)),0,(VLOOKUP(D23,'Bildirim İçin'!$B$3:$T$90,19,FALSE)))","v":0},{"$f":"IF(ISERROR(VLOOKUP(D23,'Bildirim İçin'!$B$3:$R$90,12,FALSE)),0,(VLOOKUP(D23,'Bildirim İçin'!$B$3:$R$90,12,FALSE)))","v":0},{"$f":"IF(ISERROR(VLOOKUP(D23,'Bildirim İçin'!$B$3:$R$90,6,FALSE)),0,(VLOOKUP(D23,'Bildirim İçin'!$B$3:$R$90,6,FALSE)))","v":0},0,{"$f":"IF(ISERROR(VLOOKUP(D23,'Bildirim İçin'!$B$3:$R$90,15,FALSE)),0,(VLOOKUP(D23,'Bildirim İçin'!$B$3:$R$90,15,FALSE)))","v":0},{"$f":"IF(ISERROR(VLOOKUP(D23,'Bildirim İçin'!$B$3:$T$90,18,FALSE)),0,(VLOOKUP(D23,'Bildirim İçin'!$B$3:$T$90,18,FALSE)))","v":0},{"$f":"IF(ISERROR(VLOOKUP(D23,'Bildirim İçin'!$B$3:$Y$90,22,FALSE)),0,(VLOOKUP(D23,'Bildirim İçin'!$B$3:$Y$90,22,FALSE)))","v":0},{"$f":"IF(ISERROR(VLOOKUP(D23,'Bildirim İçin'!$B$3:$Y$90,24,FALSE)),0,(VLOOKUP(D23,'Bildirim İçin'!$B$3:$Y$90,24,FALSE)))","v":0},0,{"$f":"IF(ISERROR(VLOOKUP(D23,'Bildirim İçin'!$B$3:$Z$90,25,FALSE)),0,(VLOOKUP(D23,'Bildirim İçin'!$B$3:$Z$90,25,FALSE)))","v":0},0,{"$f":"IF(ISERROR(VLOOKUP(D23,'Bildirim İçin'!$B$3:$R$90,13,FALSE)),0,(VLOOKUP(D23,'Bildirim İçin'!$B$3:$R$90,13,FALSE)))","v":"00:00:00"},{"$f":"IF(ISERROR(VLOOKUP(D23,'Bildirim İçin'!$B$3:$R$90,14,FALSE)),0,(VLOOKUP(D23,'Bildirim İçin'!$B$3:$R$90,14,FALSE)))","v":"00:00:00"}]
[null,null,null,null,null,null,null,null,{"$f":"IF(ISERROR(VLOOKUP(D24,'Bildirim İçin'!$B$3:$R$90,10,FALSE)),0,(VLOOKUP(D24,'Bildirim İçin'!$B$3:$R$90,10,FALSE)))","v":"00:00:00"},{"$f":"IF(ISERROR(VLOOKUP(D24,'Bildirim İçin'!$B$3:$R$90,11,FALSE)),0,(VLOOKUP(D24,'Bildirim İçin'!$B$3:$R$90,11,FALSE)))","v":"00:00:00"},{"$f":"IF(ISERROR(VLOOKUP(D24,'Bildirim İçin'!$B$3:$T$90,19,FALSE)),0,(VLOOKUP(D24,'Bildirim İçin'!$B$3:$T$90,19,FALSE)))","v":0},{"$f":"IF(ISERROR(VLOOKUP(D24,'Bildirim İçin'!$B$3:$R$90,12,FALSE)),0,(VLOOKUP(D24,'Bildirim İçin'!$B$3:$R$90,12,FALSE)))","v":0},{"$f":"IF(ISERROR(VLOOKUP(D24,'Bildirim İçin'!$B$3:$R$90,6,FALSE)),0,(VLOOKUP(D24,'Bildirim İçin'!$B$3:$R$90,6,FALSE)))","v":0},0,{"$f":"IF(ISERROR(VLOOKUP(D24,'Bildirim İçin'!$B$3:$R$90,15,FALSE)),0,(VLOOKUP(D24,'Bildirim İçin'!$B$3:$R$90,15,FALSE)))","v":0},{"$f":"IF(ISERROR(VLOOKUP(D24,'Bildirim İçin'!$B$3:$T$90,18,FALSE)),0,(VLOOKUP(D24,'Bildirim İçin'!$B$3:$T$90,18,FALSE)))","v":0},{"$f":"IF(ISERROR(VLOOKUP(D24,'Bildirim İçin'!$B$3:$Y$90,22,FALSE)),0,(VLOOKUP(D24,'Bildirim İçin'!$B$3:$Y$90,22,FALSE)))","v":0},{"$f":"IF(ISERROR(VLOOKUP(D24,'Bildirim İçin'!$B$3:$Y$90,24,FALSE)),0,(VLOOKUP(D24,'Bildirim İçin'!$B$3:$Y$90,24,FALSE)))","v":0},0,{"$f":"IF(ISERROR(VLOOKUP(D24,'Bildirim İçin'!$B$3:$Z$90,25,FALSE)),0,(VLOOKUP(D24,'Bildirim İçin'!$B$3:$Z$90,25,FALSE)))","v":0},0,{"$f":"IF(ISERROR(VLOOKUP(D24,'Bildirim İçin'!$B$3:$R$90,13,FALSE)),0,(VLOOKUP(D24,'Bildirim İçin'!$B$3:$R$90,13,FALSE)))","v":"00:00:00"},{"$f":"IF(ISERROR(VLOOKUP(D24,'Bildirim İçin'!$B$3:$R$90,14,FALSE)),0,(VLOOKUP(D24,'Bildirim İçin'!$B$3:$R$90,14,FALSE)))","v":"00:00:00"}]
[null,null,null,null,null,null,null,null,{"$f":"IF(ISERROR(VLOOKUP(D25,'Bildirim İçin'!$B$3:$R$90,10,FALSE)),0,(VLOOKUP(D25,'Bildirim İçin'!$B$3:$R$90,10,FALSE)))","v":"00:00:00"},{"$f":"IF(ISERROR(VLOOKUP(D25,'Bildirim İçin'!$B$3:$R$90,11,FALSE)),0,(VLOOKUP(D25,'Bildirim İçin'!$B$3:$R$90,11,FALSE)))","v":"00:00:00"},{"$f":"IF(ISERROR(VLOOKUP(D25,'Bildirim İçin'!$B$3:$T$90,19,FALSE)),0,(VLOOKUP(D25,'Bildirim İçin'!$B$3:$T$90,19,FALSE)))","v":0},{"$f":"IF(ISERROR(VLOOKUP(D25,'Bildirim İçin'!$B$3:$R$90,12,FALSE)),0,(VLOOKUP(D25,'Bildirim İçin'!$B$3:$R$90,12,FALSE)))","v":0},{"$f":"IF(ISERROR(VLOOKUP(D25,'Bildirim İçin'!$B$3:$R$90,6,FALSE)),0,(VLOOKUP(D25,'Bildirim İçin'!$B$3:$R$90,6,FALSE)))","v":0},0,{"$f":"IF(ISERROR(VLOOKUP(D25,'Bildirim İçin'!$B$3:$R$90,15,FALSE)),0,(VLOOKUP(D25,'Bildirim İçin'!$B$3:$R$90,15,FALSE)))","v":0},{"$f":"IF(ISERROR(VLOOKUP(D25,'Bildirim İçin'!$B$3:$T$90,18,FALSE)),0,(VLOOKUP(D25,'Bildirim İçin'!$B$3:$T$90,18,FALSE)))","v":0},{"$f":"IF(ISERROR(VLOOKUP(D25,'Bildirim İçin'!$B$3:$Y$90,22,FALSE)),0,(VLOOKUP(D25,'Bildirim İçin'!$B$3:$Y$90,22,FALSE)))","v":0},{"$f":"IF(ISERROR(VLOOKUP(D25,'Bildirim İçin'!$B$3:$Y$90,24,FALSE)),0,(VLOOKUP(D25,'Bildirim İçin'!$B$3:$Y$90,24,FALSE)))","v":0},0,{"$f":"IF(ISERROR(VLOOKUP(D25,'Bildirim İçin'!$B$3:$Z$90,25,FALSE)),0,(VLOOKUP(D25,'Bildirim İçin'!$B$3:$Z$90,25,FALSE)))","v":0},0,{"$f":"IF(ISERROR(VLOOKUP(D25,'Bildirim İçin'!$B$3:$R$90,13,FALSE)),0,(VLOOKUP(D25,'Bildirim İçin'!$B$3:$R$90,13,FALSE)))","v":"00:00:00"},{"$f":"IF(ISERROR(VLOOKUP(D25,'Bildirim İçin'!$B$3:$R$90,14,FALSE)),0,(VLOOKUP(D25,'Bildirim İçin'!$B$3:$R$90,14,FALSE)))","v":"00:00:00"}]
[null,null,null,null,null,null,null,null,{"$f":"IF(ISERROR(VLOOKUP(D26,'Bildirim İçin'!$B$3:$R$90,10,FALSE)),0,(VLOOKUP(D26,'Bildirim İçin'!$B$3:$R$90,10,FALSE)))","v":"00:00:00"},{"$f":"IF(ISERROR(VLOOKUP(D26,'Bildirim İçin'!$B$3:$R$90,11,FALSE)),0,(VLOOKUP(D26,'Bildirim İçin'!$B$3:$R$90,11,FALSE)))","v":"00:00:00"},{"$f":"IF(ISERROR(VLOOKUP(D26,'Bildirim İçin'!$B$3:$T$90,19,FALSE)),0,(VLOOKUP(D26,'Bildirim İçin'!$B$3:$T$90,19,FALSE)))","v":0},{"$f":"IF(ISERROR(VLOOKUP(D26,'Bildirim İçin'!$B$3:$R$90,12,FALSE)),0,(VLOOKUP(D26,'Bildirim İçin'!$B$3:$R$90,12,FALSE)))","v":0},{"$f":"IF(ISERROR(VLOOKUP(D26,'Bildirim İçin'!$B$3:$R$90,6,FALSE)),0,(VLOOKUP(D26,'Bildirim İçin'!$B$3:$R$90,6,FALSE)))","v":0},0,{"$f":"IF(ISERROR(VLOOKUP(D26,'Bildirim İçin'!$B$3:$R$90,15,FALSE)),0,(VLOOKUP(D26,'Bildirim İçin'!$B$3:$R$90,15,FALSE)))","v":0},{"$f":"IF(ISERROR(VLOOKUP(D26,'Bildirim İçin'!$B$3:$T$90,18,FALSE)),0,(VLOOKUP(D26,'Bildirim İçin'!$B$3:$T$90,18,FALSE)))","v":0},{"$f":"IF(ISERROR(VLOOKUP(D26,'Bildirim İçin'!$B$3:$Y$90,22,FALSE)),0,(VLOOKUP(D26,'Bildirim İçin'!$B$3:$Y$90,22,FALSE)))","v":0},{"$f":"IF(ISERROR(VLOOKUP(D26,'Bildirim İçin'!$B$3:$Y$90,24,FALSE)),0,(VLOOKUP(D26,'Bildirim İçin'!$B$3:$Y$90,24,FALSE)))","v":0},0,{"$f":"IF(ISERROR(VLOOKUP(D26,'Bildirim İçin'!$B$3:$Z$90,25,FALSE)),0,(VLOOKUP(D26,'Bildirim İçin'!$B$3:$Z$90,25,FALSE)))","v":0},0,{"$f":"IF(ISERROR(VLOOKUP(D26,'Bildirim İçin'!$B$3:$R$90,13,FALSE)),0,(VLOOKUP(D26,'Bildirim İçin'!$B$3:$R$90,13,FALSE)))","v":"00:00:00"},{"$f":"IF(ISERROR(VLOOKUP(D26,'Bildirim İçin'!$B$3:$R$90,14,FALSE)),0,(VLOOKUP(D26,'Bildirim İçin'!$B$3:$R$90,14,FALSE)))","v":"00:00:00"}]
[null,null,null,null,null,null,null,null,{"$f":"IF(ISERROR(VLOOKUP(D27,'Bildirim İçin'!$B$3:$R$90,10,FALSE)),0,(VLOOKUP(D27,'Bildirim İçin'!$B$3:$R$90,10,FALSE)))","v":"00:00:00"},{"$f":"IF(ISERROR(VLOOKUP(D27,'Bildirim İçin'!$B$3:$R$90,11,FALSE)),0,(VLOOKUP(D27,'Bildirim İçin'!$B$3:$R$90,11,FALSE)))","v":"00:00:00"},{"$f":"IF(ISERROR(VLOOKUP(D27,'Bildirim İçin'!$B$3:$T$90,19,FALSE)),0,(VLOOKUP(D27,'Bildirim İçin'!$B$3:$T$90,19,FALSE)))","v":0},{"$f":"IF(ISERROR(VLOOKUP(D27,'Bildirim İçin'!$B$3:$R$90,12,FALSE)),0,(VLOOKUP(D27,'Bildirim İçin'!$B$3:$R$90,12,FALSE)))","v":0},{"$f":"IF(ISERROR(VLOOKUP(D27,'Bildirim İçin'!$B$3:$R$90,6,FALSE)),0,(VLOOKUP(D27,'Bildirim İçin'!$B$3:$R$90,6,FALSE)))","v":0},0,{"$f":"IF(ISERROR(VLOOKUP(D27,'Bildirim İçin'!$B$3:$R$90,15,FALSE)),0,(VLOOKUP(D27,'Bildirim İçin'!$B$3:$R$90,15,FALSE)))","v":0},{"$f":"IF(ISERROR(VLOOKUP(D27,'Bildirim İçin'!$B$3:$T$90,18,FALSE)),0,(VLOOKUP(D27,'Bildirim İçin'!$B$3:$T$90,18,FALSE)))","v":0},{"$f":"IF(ISERROR(VLOOKUP(D27,'Bildirim İçin'!$B$3:$Y$90,22,FALSE)),0,(VLOOKUP(D27,'Bildirim İçin'!$B$3:$Y$90,22,FALSE)))","v":0},{"$f":"IF(ISERROR(VLOOKUP(D27,'Bildirim İçin'!$B$3:$Y$90,24,FALSE)),0,(VLOOKUP(D27,'Bildirim İçin'!$B$3:$Y$90,24,FALSE)))","v":0},0,{"$f":"IF(ISERROR(VLOOKUP(D27,'Bildirim İçin'!$B$3:$Z$90,25,FALSE)),0,(VLOOKUP(D27,'Bildirim İçin'!$B$3:$Z$90,25,FALSE)))","v":0},0,{"$f":"IF(ISERROR(VLOOKUP(D27,'Bildirim İçin'!$B$3:$R$90,13,FALSE)),0,(VLOOKUP(D27,'Bildirim İçin'!$B$3:$R$90,13,FALSE)))","v":"00:00:00"},{"$f":"IF(ISERROR(VLOOKUP(D27,'Bildirim İçin'!$B$3:$R$90,14,FALSE)),0,(VLOOKUP(D27,'Bildirim İçin'!$B$3:$R$90,14,FALSE)))","v":"00:00:00"}]
[null,null,null,null,null,null,null,null,{"$f":"IF(ISERROR(VLOOKUP(D28,'Bildirim İçin'!$B$3:$R$90,10,FALSE)),0,(VLOOKUP(D28,'Bildirim İçin'!$B$3:$R$90,10,FALSE)))","v":"00:00:00"},{"$f":"IF(ISERROR(VLOOKUP(D28,'Bildirim İçin'!$B$3:$R$90,11,FALSE)),0,(VLOOKUP(D28,'Bildirim İçin'!$B$3:$R$90,11,FALSE)))","v":"00:00:00"},{"$f":"IF(ISERROR(VLOOKUP(D28,'Bildirim İçin'!$B$3:$T$90,19,FALSE)),0,(VLOOKUP(D28,'Bildirim İçin'!$B$3:$T$90,19,FALSE)))","v":0},{"$f":"IF(ISERROR(VLOOKUP(D28,'Bildirim İçin'!$B$3:$R$90,12,FALSE)),0,(VLOOKUP(D28,'Bildirim İçin'!$B$3:$R$90,12,FALSE)))","v":0},{"$f":"IF(ISERROR(VLOOKUP(D28,'Bildirim İçin'!$B$3:$R$90,6,FALSE)),0,(VLOOKUP(D28,'Bildirim İçin'!$B$3:$R$90,6,FALSE)))","v":0},0,{"$f":"IF(ISERROR(VLOOKUP(D28,'Bildirim İçin'!$B$3:$R$90,15,FALSE)),0,(VLOOKUP(D28,'Bildirim İçin'!$B$3:$R$90,15,FALSE)))","v":0},{"$f":"IF(ISERROR(VLOOKUP(D28,'Bildirim İçin'!$B$3:$T$90,18,FALSE)),0,(VLOOKUP(D28,'Bildirim İçin'!$B$3:$T$90,18,FALSE)))","v":0},{"$f":"IF(ISERROR(VLOOKUP(D28,'Bildirim İçin'!$B$3:$Y$90,22,FALSE)),0,(VLOOKUP(D28,'Bildirim İçin'!$B$3:$Y$90,22,FALSE)))","v":0},{"$f":"IF(ISERROR(VLOOKUP(D28,'Bildirim İçin'!$B$3:$Y$90,24,FALSE)),0,(VLOOKUP(D28,'Bildirim İçin'!$B$3:$Y$90,24,FALSE)))","v":0},0,{"$f":"IF(ISERROR(VLOOKUP(D28,'Bildirim İçin'!$B$3:$Z$90,25,FALSE)),0,(VLOOKUP(D28,'Bildirim İçin'!$B$3:$Z$90,25,FALSE)))","v":0},0,{"$f":"IF(ISERROR(VLOOKUP(D28,'Bildirim İçin'!$B$3:$R$90,13,FALSE)),0,(VLOOKUP(D28,'Bildirim İçin'!$B$3:$R$90,13,FALSE)))","v":"00:00:00"},{"$f":"IF(ISERROR(VLOOKUP(D28,'Bildirim İçin'!$B$3:$R$90,14,FALSE)),0,(VLOOKUP(D28,'Bildirim İçin'!$B$3:$R$90,14,FALSE)))","v":"00:00:00"}]
[null,null,null,null,null,null,null,null,{"$f":"IF(ISERROR(VLOOKUP(D29,'Bildirim İçin'!$B$3:$R$90,10,FALSE)),0,(VLOOKUP(D29,'Bildirim İçin'!$B$3:$R$90,10,FALSE)))","v":"00:00:00"},{"$f":"IF(ISERROR(VLOOKUP(D29,'Bildirim İçin'!$B$3:$R$90,11,FALSE)),0,(VLOOKUP(D29,'Bildirim İçin'!$B$3:$R$90,11,FALSE)))","v":"00:00:00"},{"$f":"IF(ISERROR(VLOOKUP(D29,'Bildirim İçin'!$B$3:$T$90,19,FALSE)),0,(VLOOKUP(D29,'Bildirim İçin'!$B$3:$T$90,19,FALSE)))","v":0},{"$f":"IF(ISERROR(VLOOKUP(D29,'Bildirim İçin'!$B$3:$R$90,12,FALSE)),0,(VLOOKUP(D29,'Bildirim İçin'!$B$3:$R$90,12,FALSE)))","v":0},{"$f":"IF(ISERROR(VLOOKUP(D29,'Bildirim İçin'!$B$3:$R$90,6,FALSE)),0,(VLOOKUP(D29,'Bildirim İçin'!$B$3:$R$90,6,FALSE)))","v":0},0,{"$f":"IF(ISERROR(VLOOKUP(D29,'Bildirim İçin'!$B$3:$R$90,15,FALSE)),0,(VLOOKUP(D29,'Bildirim İçin'!$B$3:$R$90,15,FALSE)))","v":0},{"$f":"IF(ISERROR(VLOOKUP(D29,'Bildirim İçin'!$B$3:$T$90,18,FALSE)),0,(VLOOKUP(D29,'Bildirim İçin'!$B$3:$T$90,18,FALSE)))","v":0},{"$f":"IF(ISERROR(VLOOKUP(D29,'Bildirim İçin'!$B$3:$Y$90,22,FALSE)),0,(VLOOKUP(D29,'Bildirim İçin'!$B$3:$Y$90,22,FALSE)))","v":0},{"$f":"IF(ISERROR(VLOOKUP(D29,'Bildirim İçin'!$B$3:$Y$90,24,FALSE)),0,(VLOOKUP(D29,'Bildirim İçin'!$B$3:$Y$90,24,FALSE)))","v":0},0,{"$f":"IF(ISERROR(VLOOKUP(D29,'Bildirim İçin'!$B$3:$Z$90,25,FALSE)),0,(VLOOKUP(D29,'Bildirim İçin'!$B$3:$Z$90,25,FALSE)))","v":0},0,{"$f":"IF(ISERROR(VLOOKUP(D29,'Bildirim İçin'!$B$3:$R$90,13,FALSE)),0,(VLOOKUP(D29,'Bildirim İçin'!$B$3:$R$90,13,FALSE)))","v":"00:00:00"},{"$f":"IF(ISERROR(VLOOKUP(D29,'Bildirim İçin'!$B$3:$R$90,14,FALSE)),0,(VLOOKUP(D29,'Bildirim İçin'!$B$3:$R$90,14,FALSE)))","v":"00:00:00"}]
[null,null,null,null,null,null,null,null,{"$f":"IF(ISERROR(VLOOKUP(D30,'Bildirim İçin'!$B$3:$R$90,10,FALSE)),0,(VLOOKUP(D30,'Bildirim İçin'!$B$3:$R$90,10,FALSE)))","v":"00:00:00"},{"$f":"IF(ISERROR(VLOOKUP(D30,'Bildirim İçin'!$B$3:$R$90,11,FALSE)),0,(VLOOKUP(D30,'Bildirim İçin'!$B$3:$R$90,11,FALSE)))","v":"00:00:00"},{"$f":"IF(ISERROR(VLOOKUP(D30,'Bildirim İçin'!$B$3:$T$90,19,FALSE)),0,(VLOOKUP(D30,'Bildirim İçin'!$B$3:$T$90,19,FALSE)))","v":0},{"$f":"IF(ISERROR(VLOOKUP(D30,'Bildirim İçin'!$B$3:$R$90,12,FALSE)),0,(VLOOKUP(D30,'Bildirim İçin'!$B$3:$R$90,12,FALSE)))","v":0},{"$f":"IF(ISERROR(VLOOKUP(D30,'Bildirim İçin'!$B$3:$R$90,6,FALSE)),0,(VLOOKUP(D30,'Bildirim İçin'!$B$3:$R$90,6,FALSE)))","v":0},0,{"$f":"IF(ISERROR(VLOOKUP(D30,'Bildirim İçin'!$B$3:$R$90,15,FALSE)),0,(VLOOKUP(D30,'Bildirim İçin'!$B$3:$R$90,15,FALSE)))","v":0},{"$f":"IF(ISERROR(VLOOKUP(D30,'Bildirim İçin'!$B$3:$T$90,18,FALSE)),0,(VLOOKUP(D30,'Bildirim İçin'!$B$3:$T$90,18,FALSE)))","v":0},{"$f":"IF(ISERROR(VLOOKUP(D30,'Bildirim İçin'!$B$3:$Y$90,22,FALSE)),0,(VLOOKUP(D30,'Bildirim İçin'!$B$3:$Y$90,22,FALSE)))","v":0},{"$f":"IF(ISERROR(VLOOKUP(D30,'Bildirim İçin'!$B$3:$Y$90,24,FALSE)),0,(VLOOKUP(D30,'Bildirim İçin'!$B$3:$Y$90,24,FALSE)))","v":0},0,{"$f":"IF(ISERROR(VLOOKUP(D30,'Bildirim İçin'!$B$3:$Z$90,25,FALSE)),0,(VLOOKUP(D30,'Bildirim İçin'!$B$3:$Z$90,25,FALSE)))","v":0},0,{"$f":"IF(ISERROR(VLOOKUP(D30,'Bildirim İçin'!$B$3:$R$90,13,FALSE)),0,(VLOOKUP(D30,'Bildirim İçin'!$B$3:$R$90,13,FALSE)))","v":"00:00:00"},{"$f":"IF(ISERROR(VLOOKUP(D30,'Bildirim İçin'!$B$3:$R$90,14,FALSE)),0,(VLOOKUP(D30,'Bildirim İçin'!$B$3:$R$90,14,FALSE)))","v":"00:00:00"}]
[null,null,null,null,null,null,null,null,{"$f":"IF(ISERROR(VLOOKUP(D31,'Bildirim İçin'!$B$3:$R$90,10,FALSE)),0,(VLOOKUP(D31,'Bildirim İçin'!$B$3:$R$90,10,FALSE)))","v":"00:00:00"},{"$f":"IF(ISERROR(VLOOKUP(D31,'Bildirim İçin'!$B$3:$R$90,11,FALSE)),0,(VLOOKUP(D31,'Bildirim İçin'!$B$3:$R$90,11,FALSE)))","v":"00:00:00"},{"$f":"IF(ISERROR(VLOOKUP(D31,'Bildirim İçin'!$B$3:$T$90,19,FALSE)),0,(VLOOKUP(D31,'Bildirim İçin'!$B$3:$T$90,19,FALSE)))","v":0},{"$f":"IF(ISERROR(VLOOKUP(D31,'Bildirim İçin'!$B$3:$R$90,12,FALSE)),0,(VLOOKUP(D31,'Bildirim İçin'!$B$3:$R$90,12,FALSE)))","v":0},{"$f":"IF(ISERROR(VLOOKUP(D31,'Bildirim İçin'!$B$3:$R$90,6,FALSE)),0,(VLOOKUP(D31,'Bildirim İçin'!$B$3:$R$90,6,FALSE)))","v":0},0,{"$f":"IF(ISERROR(VLOOKUP(D31,'Bildirim İçin'!$B$3:$R$90,15,FALSE)),0,(VLOOKUP(D31,'Bildirim İçin'!$B$3:$R$90,15,FALSE)))","v":0},{"$f":"IF(ISERROR(VLOOKUP(D31,'Bildirim İçin'!$B$3:$T$90,18,FALSE)),0,(VLOOKUP(D31,'Bildirim İçin'!$B$3:$T$90,18,FALSE)))","v":0},{"$f":"IF(ISERROR(VLOOKUP(D31,'Bildirim İçin'!$B$3:$Y$90,22,FALSE)),0,(VLOOKUP(D31,'Bildirim İçin'!$B$3:$Y$90,22,FALSE)))","v":0},{"$f":"IF(ISERROR(VLOOKUP(D31,'Bildirim İçin'!$B$3:$Y$90,24,FALSE)),0,(VLOOKUP(D31,'Bildirim İçin'!$B$3:$Y$90,24,FALSE)))","v":0},0,{"$f":"IF(ISERROR(VLOOKUP(D31,'Bildirim İçin'!$B$3:$Z$90,25,FALSE)),0,(VLOOKUP(D31,'Bildirim İçin'!$B$3:$Z$90,25,FALSE)))","v":0},0,{"$f":"IF(ISERROR(VLOOKUP(D31,'Bildirim İçin'!$B$3:$R$90,13,FALSE)),0,(VLOOKUP(D31,'Bildirim İçin'!$B$3:$R$90,13,FALSE)))","v":"00:00:00"},{"$f":"IF(ISERROR(VLOOKUP(D31,'Bildirim İçin'!$B$3:$R$90,14,FALSE)),0,(VLOOKUP(D31,'Bildirim İçin'!$B$3:$R$90,14,FALSE)))","v":"00:00:00"}]
[null,null,null,null,null,null,null,null,{"$f":"IF(ISERROR(VLOOKUP(D32,'Bildirim İçin'!$B$3:$R$90,10,FALSE)),0,(VLOOKUP(D32,'Bildirim İçin'!$B$3:$R$90,10,FALSE)))","v":"00:00:00"},{"$f":"IF(ISERROR(VLOOKUP(D32,'Bildirim İçin'!$B$3:$R$90,11,FALSE)),0,(VLOOKUP(D32,'Bildirim İçin'!$B$3:$R$90,11,FALSE)))","v":"00:00:00"},{"$f":"IF(ISERROR(VLOOKUP(D32,'Bildirim İçin'!$B$3:$T$90,19,FALSE)),0,(VLOOKUP(D32,'Bildirim İçin'!$B$3:$T$90,19,FALSE)))","v":0},{"$f":"IF(ISERROR(VLOOKUP(D32,'Bildirim İçin'!$B$3:$R$90,12,FALSE)),0,(VLOOKUP(D32,'Bildirim İçin'!$B$3:$R$90,12,FALSE)))","v":0},{"$f":"IF(ISERROR(VLOOKUP(D32,'Bildirim İçin'!$B$3:$R$90,6,FALSE)),0,(VLOOKUP(D32,'Bildirim İçin'!$B$3:$R$90,6,FALSE)))","v":0},0,{"$f":"IF(ISERROR(VLOOKUP(D32,'Bildirim İçin'!$B$3:$R$90,15,FALSE)),0,(VLOOKUP(D32,'Bildirim İçin'!$B$3:$R$90,15,FALSE)))","v":0},{"$f":"IF(ISERROR(VLOOKUP(D32,'Bildirim İçin'!$B$3:$T$90,18,FALSE)),0,(VLOOKUP(D32,'Bildirim İçin'!$B$3:$T$90,18,FALSE)))","v":0},{"$f":"IF(ISERROR(VLOOKUP(D32,'Bildirim İçin'!$B$3:$Y$90,22,FALSE)),0,(VLOOKUP(D32,'Bildirim İçin'!$B$3:$Y$90,22,FALSE)))","v":0},{"$f":"IF(ISERROR(VLOOKUP(D32,'Bildirim İçin'!$B$3:$Y$90,24,FALSE)),0,(VLOOKUP(D32,'Bildirim İçin'!$B$3:$Y$90,24,FALSE)))","v":0},0,{"$f":"IF(ISERROR(VLOOKUP(D32,'Bildirim İçin'!$B$3:$Z$90,25,FALSE)),0,(VLOOKUP(D32,'Bildirim İçin'!$B$3:$Z$90,25,FALSE)))","v":0},0,{"$f":"IF(ISERROR(VLOOKUP(D32,'Bildirim İçin'!$B$3:$R$90,13,FALSE)),0,(VLOOKUP(D32,'Bildirim İçin'!$B$3:$R$90,13,FALSE)))","v":"00:00:00"},{"$f":"IF(ISERROR(VLOOKUP(D32,'Bildirim İçin'!$B$3:$R$90,14,FALSE)),0,(VLOOKUP(D32,'Bildirim İçin'!$B$3:$R$90,14,FALSE)))","v":"00:00:00"}]
[null,null,null,null,null,null,null,null,{"$f":"IF(ISERROR(VLOOKUP(D33,'Bildirim İçin'!$B$3:$R$90,10,FALSE)),0,(VLOOKUP(D33,'Bildirim İçin'!$B$3:$R$90,10,FALSE)))","v":"00:00:00"},{"$f":"IF(ISERROR(VLOOKUP(D33,'Bildirim İçin'!$B$3:$R$90,11,FALSE)),0,(VLOOKUP(D33,'Bildirim İçin'!$B$3:$R$90,11,FALSE)))","v":"00:00:00"},{"$f":"IF(ISERROR(VLOOKUP(D33,'Bildirim İçin'!$B$3:$T$90,19,FALSE)),0,(VLOOKUP(D33,'Bildirim İçin'!$B$3:$T$90,19,FALSE)))","v":0},{"$f":"IF(ISERROR(VLOOKUP(D33,'Bildirim İçin'!$B$3:$R$90,12,FALSE)),0,(VLOOKUP(D33,'Bildirim İçin'!$B$3:$R$90,12,FALSE)))","v":0},{"$f":"IF(ISERROR(VLOOKUP(D33,'Bildirim İçin'!$B$3:$R$90,6,FALSE)),0,(VLOOKUP(D33,'Bildirim İçin'!$B$3:$R$90,6,FALSE)))","v":0},0,{"$f":"IF(ISERROR(VLOOKUP(D33,'Bildirim İçin'!$B$3:$R$90,15,FALSE)),0,(VLOOKUP(D33,'Bildirim İçin'!$B$3:$R$90,15,FALSE)))","v":0},{"$f":"IF(ISERROR(VLOOKUP(D33,'Bildirim İçin'!$B$3:$T$90,18,FALSE)),0,(VLOOKUP(D33,'Bildirim İçin'!$B$3:$T$90,18,FALSE)))","v":0},{"$f":"IF(ISERROR(VLOOKUP(D33,'Bildirim İçin'!$B$3:$Y$90,22,FALSE)),0,(VLOOKUP(D33,'Bildirim İçin'!$B$3:$Y$90,22,FALSE)))","v":0},{"$f":"IF(ISERROR(VLOOKUP(D33,'Bildirim İçin'!$B$3:$Y$90,24,FALSE)),0,(VLOOKUP(D33,'Bildirim İçin'!$B$3:$Y$90,24,FALSE)))","v":0},0,{"$f":"IF(ISERROR(VLOOKUP(D33,'Bildirim İçin'!$B$3:$Z$90,25,FALSE)),0,(VLOOKUP(D33,'Bildirim İçin'!$B$3:$Z$90,25,FALSE)))","v":0},0,{"$f":"IF(ISERROR(VLOOKUP(D33,'Bildirim İçin'!$B$3:$R$90,13,FALSE)),0,(VLOOKUP(D33,'Bildirim İçin'!$B$3:$R$90,13,FALSE)))","v":"00:00:00"},{"$f":"IF(ISERROR(VLOOKUP(D33,'Bildirim İçin'!$B$3:$R$90,14,FALSE)),0,(VLOOKUP(D33,'Bildirim İçin'!$B$3:$R$90,14,FALSE)))","v":"00:00:00"}]
[null,null,null,null,null,null,null,null,{"$f":"IF(ISERROR(VLOOKUP(D34,'Bildirim İçin'!$B$3:$R$90,10,FALSE)),0,(VLOOKUP(D34,'Bildirim İçin'!$B$3:$R$90,10,FALSE)))","v":"00:00:00"},{"$f":"IF(ISERROR(VLOOKUP(D34,'Bildirim İçin'!$B$3:$R$90,11,FALSE)),0,(VLOOKUP(D34,'Bildirim İçin'!$B$3:$R$90,11,FALSE)))","v":"00:00:00"},{"$f":"IF(ISERROR(VLOOKUP(D34,'Bildirim İçin'!$B$3:$T$90,19,FALSE)),0,(VLOOKUP(D34,'Bildirim İçin'!$B$3:$T$90,19,FALSE)))","v":0},{"$f":"IF(ISERROR(VLOOKUP(D34,'Bildirim İçin'!$B$3:$R$90,12,FALSE)),0,(VLOOKUP(D34,'Bildirim İçin'!$B$3:$R$90,12,FALSE)))","v":0},{"$f":"IF(ISERROR(VLOOKUP(D34,'Bildirim İçin'!$B$3:$R$90,6,FALSE)),0,(VLOOKUP(D34,'Bildirim İçin'!$B$3:$R$90,6,FALSE)))","v":0},0,{"$f":"IF(ISERROR(VLOOKUP(D34,'Bildirim İçin'!$B$3:$R$90,15,FALSE)),0,(VLOOKUP(D34,'Bildirim İçin'!$B$3:$R$90,15,FALSE)))","v":0},{"$f":"IF(ISERROR(VLOOKUP(D34,'Bildirim İçin'!$B$3:$T$90,18,FALSE)),0,(VLOOKUP(D34,'Bildirim İçin'!$B$3:$T$90,18,FALSE)))","v":0},{"$f":"IF(ISERROR(VLOOKUP(D34,'Bildirim İçin'!$B$3:$Y$90,22,FALSE)),0,(VLOOKUP(D34,'Bildirim İçin'!$B$3:$Y$90,22,FALSE)))","v":0},{"$f":"IF(ISERROR(VLOOKUP(D34,'Bildirim İçin'!$B$3:$Y$90,24,FALSE)),0,(VLOOKUP(D34,'Bildirim İçin'!$B$3:$Y$90,24,FALSE)))","v":0},0,{"$f":"IF(ISERROR(VLOOKUP(D34,'Bildirim İçin'!$B$3:$Z$90,25,FALSE)),0,(VLOOKUP(D34,'Bildirim İçin'!$B$3:$Z$90,25,FALSE)))","v":0},0,{"$f":"IF(ISERROR(VLOOKUP(D34,'Bildirim İçin'!$B$3:$R$90,13,FALSE)),0,(VLOOKUP(D34,'Bildirim İçin'!$B$3:$R$90,13,FALSE)))","v":"00:00:00"},{"$f":"IF(ISERROR(VLOOKUP(D34,'Bildirim İçin'!$B$3:$R$90,14,FALSE)),0,(VLOOKUP(D34,'Bildirim İçin'!$B$3:$R$90,14,FALSE)))","v":"00:00:00"}]
[null,null,null,null,null,null,null,null,{"$f":"IF(ISERROR(VLOOKUP(D35,'Bildirim İçin'!$B$3:$R$90,10,FALSE)),0,(VLOOKUP(D35,'Bildirim İçin'!$B$3:$R$90,10,FALSE)))","v":"00:00:00"},{"$f":"IF(ISERROR(VLOOKUP(D35,'Bildirim İçin'!$B$3:$R$90,11,FALSE)),0,(VLOOKUP(D35,'Bildirim İçin'!$B$3:$R$90,11,FALSE)))","v":"00:00:00"},{"$f":"IF(ISERROR(VLOOKUP(D35,'Bildirim İçin'!$B$3:$T$90,19,FALSE)),0,(VLOOKUP(D35,'Bildirim İçin'!$B$3:$T$90,19,FALSE)))","v":0},{"$f":"IF(ISERROR(VLOOKUP(D35,'Bildirim İçin'!$B$3:$R$90,12,FALSE)),0,(VLOOKUP(D35,'Bildirim İçin'!$B$3:$R$90,12,FALSE)))","v":0},{"$f":"IF(ISERROR(VLOOKUP(D35,'Bildirim İçin'!$B$3:$R$90,6,FALSE)),0,(VLOOKUP(D35,'Bildirim İçin'!$B$3:$R$90,6,FALSE)))","v":0},0,{"$f":"IF(ISERROR(VLOOKUP(D35,'Bildirim İçin'!$B$3:$R$90,15,FALSE)),0,(VLOOKUP(D35,'Bildirim İçin'!$B$3:$R$90,15,FALSE)))","v":0},{"$f":"IF(ISERROR(VLOOKUP(D35,'Bildirim İçin'!$B$3:$T$90,18,FALSE)),0,(VLOOKUP(D35,'Bildirim İçin'!$B$3:$T$90,18,FALSE)))","v":0},{"$f":"IF(ISERROR(VLOOKUP(D35,'Bildirim İçin'!$B$3:$Y$90,22,FALSE)),0,(VLOOKUP(D35,'Bildirim İçin'!$B$3:$Y$90,22,FALSE)))","v":0},{"$f":"IF(ISERROR(VLOOKUP(D35,'Bildirim İçin'!$B$3:$Y$90,24,FALSE)),0,(VLOOKUP(D35,'Bildirim İçin'!$B$3:$Y$90,24,FALSE)))","v":0},0,{"$f":"IF(ISERROR(VLOOKUP(D35,'Bildirim İçin'!$B$3:$Z$90,25,FALSE)),0,(VLOOKUP(D35,'Bildirim İçin'!$B$3:$Z$90,25,FALSE)))","v":0},0,{"$f":"IF(ISERROR(VLOOKUP(D35,'Bildirim İçin'!$B$3:$R$90,13,FALSE)),0,(VLOOKUP(D35,'Bildirim İçin'!$B$3:$R$90,13,FALSE)))","v":"00:00:00"},{"$f":"IF(ISERROR(VLOOKUP(D35,'Bildirim İçin'!$B$3:$R$90,14,FALSE)),0,(VLOOKUP(D35,'Bildirim İçin'!$B$3:$R$90,14,FALSE)))","v":"00:00:00"}]
[null,null,null,null,null,null,null,null,{"$f":"IF(ISERROR(VLOOKUP(D36,'Bildirim İçin'!$B$3:$R$90,10,FALSE)),0,(VLOOKUP(D36,'Bildirim İçin'!$B$3:$R$90,10,FALSE)))","v":"00:00:00"},{"$f":"IF(ISERROR(VLOOKUP(D36,'Bildirim İçin'!$B$3:$R$90,11,FALSE)),0,(VLOOKUP(D36,'Bildirim İçin'!$B$3:$R$90,11,FALSE)))","v":"00:00:00"},{"$f":"IF(ISERROR(VLOOKUP(D36,'Bildirim İçin'!$B$3:$T$90,19,FALSE)),0,(VLOOKUP(D36,'Bildirim İçin'!$B$3:$T$90,19,FALSE)))","v":0},{"$f":"IF(ISERROR(VLOOKUP(D36,'Bildirim İçin'!$B$3:$R$90,12,FALSE)),0,(VLOOKUP(D36,'Bildirim İçin'!$B$3:$R$90,12,FALSE)))","v":0},{"$f":"IF(ISERROR(VLOOKUP(D36,'Bildirim İçin'!$B$3:$R$90,6,FALSE)),0,(VLOOKUP(D36,'Bildirim İçin'!$B$3:$R$90,6,FALSE)))","v":0},0,{"$f":"IF(ISERROR(VLOOKUP(D36,'Bildirim İçin'!$B$3:$R$90,15,FALSE)),0,(VLOOKUP(D36,'Bildirim İçin'!$B$3:$R$90,15,FALSE)))","v":0},{"$f":"IF(ISERROR(VLOOKUP(D36,'Bildirim İçin'!$B$3:$T$90,18,FALSE)),0,(VLOOKUP(D36,'Bildirim İçin'!$B$3:$T$90,18,FALSE)))","v":0},{"$f":"IF(ISERROR(VLOOKUP(D36,'Bildirim İçin'!$B$3:$Y$90,22,FALSE)),0,(VLOOKUP(D36,'Bildirim İçin'!$B$3:$Y$90,22,FALSE)))","v":0},{"$f":"IF(ISERROR(VLOOKUP(D36,'Bildirim İçin'!$B$3:$Y$90,24,FALSE)),0,(VLOOKUP(D36,'Bildirim İçin'!$B$3:$Y$90,24,FALSE)))","v":0},0,{"$f":"IF(ISERROR(VLOOKUP(D36,'Bildirim İçin'!$B$3:$Z$90,25,FALSE)),0,(VLOOKUP(D36,'Bildirim İçin'!$B$3:$Z$90,25,FALSE)))","v":0},0,{"$f":"IF(ISERROR(VLOOKUP(D36,'Bildirim İçin'!$B$3:$R$90,13,FALSE)),0,(VLOOKUP(D36,'Bildirim İçin'!$B$3:$R$90,13,FALSE)))","v":"00:00:00"},{"$f":"IF(ISERROR(VLOOKUP(D36,'Bildirim İçin'!$B$3:$R$90,14,FALSE)),0,(VLOOKUP(D36,'Bildirim İçin'!$B$3:$R$90,14,FALSE)))","v":"00:00:00"}]
[null,null,null,null,null,null,null,null,{"$f":"IF(ISERROR(VLOOKUP(D37,'Bildirim İçin'!$B$3:$R$90,10,FALSE)),0,(VLOOKUP(D37,'Bildirim İçin'!$B$3:$R$90,10,FALSE)))","v":"00:00:00"},{"$f":"IF(ISERROR(VLOOKUP(D37,'Bildirim İçin'!$B$3:$R$90,11,FALSE)),0,(VLOOKUP(D37,'Bildirim İçin'!$B$3:$R$90,11,FALSE)))","v":"00:00:00"},{"$f":"IF(ISERROR(VLOOKUP(D37,'Bildirim İçin'!$B$3:$T$90,19,FALSE)),0,(VLOOKUP(D37,'Bildirim İçin'!$B$3:$T$90,19,FALSE)))","v":0},{"$f":"IF(ISERROR(VLOOKUP(D37,'Bildirim İçin'!$B$3:$R$90,12,FALSE)),0,(VLOOKUP(D37,'Bildirim İçin'!$B$3:$R$90,12,FALSE)))","v":0},{"$f":"IF(ISERROR(VLOOKUP(D37,'Bildirim İçin'!$B$3:$R$90,6,FALSE)),0,(VLOOKUP(D37,'Bildirim İçin'!$B$3:$R$90,6,FALSE)))","v":0},0,{"$f":"IF(ISERROR(VLOOKUP(D37,'Bildirim İçin'!$B$3:$R$90,15,FALSE)),0,(VLOOKUP(D37,'Bildirim İçin'!$B$3:$R$90,15,FALSE)))","v":0},{"$f":"IF(ISERROR(VLOOKUP(D37,'Bildirim İçin'!$B$3:$T$90,18,FALSE)),0,(VLOOKUP(D37,'Bildirim İçin'!$B$3:$T$90,18,FALSE)))","v":0},{"$f":"IF(ISERROR(VLOOKUP(D37,'Bildirim İçin'!$B$3:$Y$90,22,FALSE)),0,(VLOOKUP(D37,'Bildirim İçin'!$B$3:$Y$90,22,FALSE)))","v":0},{"$f":"IF(ISERROR(VLOOKUP(D37,'Bildirim İçin'!$B$3:$Y$90,24,FALSE)),0,(VLOOKUP(D37,'Bildirim İçin'!$B$3:$Y$90,24,FALSE)))","v":0},0,{"$f":"IF(ISERROR(VLOOKUP(D37,'Bildirim İçin'!$B$3:$Z$90,25,FALSE)),0,(VLOOKUP(D37,'Bildirim İçin'!$B$3:$Z$90,25,FALSE)))","v":0},0,{"$f":"IF(ISERROR(VLOOKUP(D37,'Bildirim İçin'!$B$3:$R$90,13,FALSE)),0,(VLOOKUP(D37,'Bildirim İçin'!$B$3:$R$90,13,FALSE)))","v":"00:00:00"},{"$f":"IF(ISERROR(VLOOKUP(D37,'Bildirim İçin'!$B$3:$R$90,14,FALSE)),0,(VLOOKUP(D37,'Bildirim İçin'!$B$3:$R$90,14,FALSE)))","v":"00:00:00"}]
[null,null,null,null,null,null,null,null,{"$f":"IF(ISERROR(VLOOKUP(D38,'Bildirim İçin'!$B$3:$R$90,10,FALSE)),0,(VLOOKUP(D38,'Bildirim İçin'!$B$3:$R$90,10,FALSE)))","v":"00:00:00"},{"$f":"IF(ISERROR(VLOOKUP(D38,'Bildirim İçin'!$B$3:$R$90,11,FALSE)),0,(VLOOKUP(D38,'Bildirim İçin'!$B$3:$R$90,11,FALSE)))","v":"00:00:00"},{"$f":"IF(ISERROR(VLOOKUP(D38,'Bildirim İçin'!$B$3:$T$90,19,FALSE)),0,(VLOOKUP(D38,'Bildirim İçin'!$B$3:$T$90,19,FALSE)))","v":0},{"$f":"IF(ISERROR(VLOOKUP(D38,'Bildirim İçin'!$B$3:$R$90,12,FALSE)),0,(VLOOKUP(D38,'Bildirim İçin'!$B$3:$R$90,12,FALSE)))","v":0},{"$f":"IF(ISERROR(VLOOKUP(D38,'Bildirim İçin'!$B$3:$R$90,6,FALSE)),0,(VLOOKUP(D38,'Bildirim İçin'!$B$3:$R$90,6,FALSE)))","v":0},0,{"$f":"IF(ISERROR(VLOOKUP(D38,'Bildirim İçin'!$B$3:$R$90,15,FALSE)),0,(VLOOKUP(D38,'Bildirim İçin'!$B$3:$R$90,15,FALSE)))","v":0},{"$f":"IF(ISERROR(VLOOKUP(D38,'Bildirim İçin'!$B$3:$T$90,18,FALSE)),0,(VLOOKUP(D38,'Bildirim İçin'!$B$3:$T$90,18,FALSE)))","v":0},{"$f":"IF(ISERROR(VLOOKUP(D38,'Bildirim İçin'!$B$3:$Y$90,22,FALSE)),0,(VLOOKUP(D38,'Bildirim İçin'!$B$3:$Y$90,22,FALSE)))","v":0},{"$f":"IF(ISERROR(VLOOKUP(D38,'Bildirim İçin'!$B$3:$Y$90,24,FALSE)),0,(VLOOKUP(D38,'Bildirim İçin'!$B$3:$Y$90,24,FALSE)))","v":0},0,{"$f":"IF(ISERROR(VLOOKUP(D38,'Bildirim İçin'!$B$3:$Z$90,25,FALSE)),0,(VLOOKUP(D38,'Bildirim İçin'!$B$3:$Z$90,25,FALSE)))","v":0},0,{"$f":"IF(ISERROR(VLOOKUP(D38,'Bildirim İçin'!$B$3:$R$90,13,FALSE)),0,(VLOOKUP(D38,'Bildirim İçin'!$B$3:$R$90,13,FALSE)))","v":"00:00:00"},{"$f":"IF(ISERROR(VLOOKUP(D38,'Bildirim İçin'!$B$3:$R$90,14,FALSE)),0,(VLOOKUP(D38,'Bildirim İçin'!$B$3:$R$90,14,FALSE)))","v":"00:00:00"}]
[null,null,null,null,null,null,null,null,{"$f":"IF(ISERROR(VLOOKUP(D39,'Bildirim İçin'!$B$3:$R$90,10,FALSE)),0,(VLOOKUP(D39,'Bildirim İçin'!$B$3:$R$90,10,FALSE)))","v":"00:00:00"},{"$f":"IF(ISERROR(VLOOKUP(D39,'Bildirim İçin'!$B$3:$R$90,11,FALSE)),0,(VLOOKUP(D39,'Bildirim İçin'!$B$3:$R$90,11,FALSE)))","v":"00:00:00"},{"$f":"IF(ISERROR(VLOOKUP(D39,'Bildirim İçin'!$B$3:$T$90,19,FALSE)),0,(VLOOKUP(D39,'Bildirim İçin'!$B$3:$T$90,19,FALSE)))","v":0},{"$f":"IF(ISERROR(VLOOKUP(D39,'Bildirim İçin'!$B$3:$R$90,12,FALSE)),0,(VLOOKUP(D39,'Bildirim İçin'!$B$3:$R$90,12,FALSE)))","v":0},{"$f":"IF(ISERROR(VLOOKUP(D39,'Bildirim İçin'!$B$3:$R$90,6,FALSE)),0,(VLOOKUP(D39,'Bildirim İçin'!$B$3:$R$90,6,FALSE)))","v":0},0,{"$f":"IF(ISERROR(VLOOKUP(D39,'Bildirim İçin'!$B$3:$R$90,15,FALSE)),0,(VLOOKUP(D39,'Bildirim İçin'!$B$3:$R$90,15,FALSE)))","v":0},{"$f":"IF(ISERROR(VLOOKUP(D39,'Bildirim İçin'!$B$3:$T$90,18,FALSE)),0,(VLOOKUP(D39,'Bildirim İçin'!$B$3:$T$90,18,FALSE)))","v":0},{"$f":"IF(ISERROR(VLOOKUP(D39,'Bildirim İçin'!$B$3:$Y$90,22,FALSE)),0,(VLOOKUP(D39,'Bildirim İçin'!$B$3:$Y$90,22,FALSE)))","v":0},{"$f":"IF(ISERROR(VLOOKUP(D39,'Bildirim İçin'!$B$3:$Y$90,24,FALSE)),0,(VLOOKUP(D39,'Bildirim İçin'!$B$3:$Y$90,24,FALSE)))","v":0},0,{"$f":"IF(ISERROR(VLOOKUP(D39,'Bildirim İçin'!$B$3:$Z$90,25,FALSE)),0,(VLOOKUP(D39,'Bildirim İçin'!$B$3:$Z$90,25,FALSE)))","v":0},0,{"$f":"IF(ISERROR(VLOOKUP(D39,'Bildirim İçin'!$B$3:$R$90,13,FALSE)),0,(VLOOKUP(D39,'Bildirim İçin'!$B$3:$R$90,13,FALSE)))","v":"00:00:00"},{"$f":"IF(ISERROR(VLOOKUP(D39,'Bildirim İçin'!$B$3:$R$90,14,FALSE)),0,(VLOOKUP(D39,'Bildirim İçin'!$B$3:$R$90,14,FALSE)))","v":"00:00:00"}]
[null,null,null,null,null," "," ",null,null," "," "," "," ",{"$f":"SUM(N19:N39)","v":0},{"$f":"IF(K40=\" \",\" \",IF(G40=\"R\",\"RESMİ\",IF(G40=\"T\",\"TAKSİ\",IF(G40=\"O\",\"OTOBÜS\",\" \"))))","v":" "},{"$f":"SUM(P19:P39)","v":0},{"$f":"SUM(Q19:Q39)","v":0},{"$f":"SUM(R19:R39)","v":0},null,{"$f":"SUM(T19:T39)","v":0},{"$f":"SUM(U19:U39)","v":0}," "]
[null,null,null,null,null,null," ",null,"Yukarıda belirtilen tarih / saatler arasında  yapmış olduğum geçici görev yolluluğu ile ilgili  ",null,null,null,{"$f":"U40","v":0},null,"TL.harcamaya ait bildirimdir.",null,{"$f":"TODAY()","v":"2021-11-16"}]
[null,null,null,null,null,null,null,null,null,null,null,null,null,null,null," ",null,null,null,null,null,{"$f":"+J10","v":"dkdkdk"}]
[null,null,null,null,null,null,null,null,null,null," ",null," ","BİRİM YETKİLİSİ *"]
[null,null,null,null,null,null,null,null,null,null," ",null,null," ",null,null,null,null,null,null,null," "]
[null,null,null,null,null,null,null,null,"(*) Bu kısım bildirim sahibinin görevi yerine getirmesinden bilgisi olan amir tarafından imzalanacaktır.",null,null,null,null,{"$f":"+'BİLGİ GİRİŞİ'!E22","v":0}]
[null,null,null,null,null,null,null,null,null,null,null,null,null,{"$f":"+'BİLGİ GİRİŞİ'!E23","v":0}]
[null,null,null,null,null,null,null,null,null,null,null,null," ",null,null,null,null,null,null,null,null,"İmza"]

{"sheet":"YEVİMEYELER","index":5,"n_rows":41,"n_cols":12,"rows_kept":41,"cut":false,"hidden":false,"merged":[[13,1,13,2],[8,1,8,3],[9,3,10,3],[3,1,5,2],[9,1,10,2],[11,1,11,2],[12,1,12,2]]}
[]
[]
[]
[null,"HARCİRAH",null,"2015-01-01"]
[null,null,null,"2015-12-31"]
[null,null,null,"2015 yılı Bütçe Kanunun H Cetveli",null,null,null,"Derece","Yevmiye",null,"Ek Gösterge","Yevmiye"]
[null,"5   - 15 DERECE",null,32,null,null,null,1,{"$f":"+$D$8","v":33},null,3000,{"$f":"+$D$12","v":37.5}]
[null,"1   -   4 DERECE",null,33,null,null,null,2,{"$f":"+$D$8","v":33},null,3100,{"$f":"+$D$12","v":37.5}]
[null,null,null,null,null,null,null,3,{"$f":"+$D$8","v":33},null,3200,37.5]
[null,"EK GÖSTERGESİ",null,null,null,null,null,4,{"$f":"+$D$8","v":33},null,3300,37.5]
[null,null,null,null,null,null,null,5,{"$f":"+$D$7","v":32},null,3400,37.5]
[null," 3000  -DAHİL 5800 HARİÇ",null,37.5,null,null,null,6,{"$f":"+$D$7","v":32},null,3500,37.5]
[null," 5800  -DAHİL 8000 HARİÇ",null,40,null,null,null,7,32,null,3600,37.5]
[null,8000,null,null,null,null,null,8,32,null,3700,37.5]
[null,null,null,null,null,null,null,9,32,null,3800,37.5]
[null,null,null,null,null,null,null,10,32,null,3900,37.5]
[null,null,null,null,null,null,null,11,32,null,4000,37.5]
[null,null,null,null,null,null,null,12,32,null,4100,37.5]
[null,null,null,null,null,null,null,13,32,null,4200,37.5]
[null,null,null,null,null,null,null,14,32,null,4300,37.5]
[null,null,null,null,null,null,null,15,32,null,4400,37.5]
[null,null,null,null,null,null,null,null,null,null,4500,37.5]
[null,null,null,null,null,null,null,null,null,null,4600,37.5]
[null,null,null,null,null,null,null,null,null,null,4700,37.5]
[null,null,null,null,null,null,null,null,null,null,4800,37.5]
[null,null,null,null,null,null,null,null,null,null,4900,37.5]
[null,null,null,null,null,null,null,null,null,null,5000,37.5]
[null,null,null,null,null,null,null,null,null,null,5100,37.5]
[null,null,null,null,null,null,null,null,null,null,5200,37.5]
[null,null,null,null,null,null,null,null,null,null,5300,37.5]
[null,null,null,null,null,null,null,null,null,null,5400,37.5]
[null,null,null,null,null,null,null,null,null,null,5500,37.5]
[null,null,null,null,null,null,null,null,null,null,5600,37.5]
[null,null,null,null,null,null,null,null,null,null,5700,37.5]
[null,null,null,null,null,null,null,null,null,null,5800,{"$f":"+$D$13","v":40}]
[null,null,null,null,null,null,null,null,null,null,5900,{"$f":"+$D$13","v":40}]
[null,null,null,null,null,null,null,null,null,null,6000,40]
[null,null,null,null,null,null,null,null,null,null,6100,40]
[null,null,null,null,null,null,null,null,null,null,6200,40]
[null,null,null,null,null,null,null,null,null,null,6300,40]
[null,null,null,null,null,null,null,null,null,null,6400,40]

{"sheet":"Sayfa1","index":6,"n_rows":4,"n_cols":20,"rows_kept":4,"cut":false,"hidden":false,"merged":[]}
[]
[]
[null,null,{"$f":"+'GÖREVLENDİRME ONAYI'!C12","v":"Adı Soyadı"},{"$f":"+'GÖREVLENDİRME ONAYI'!E12","v":"Görevi"},{"$f":"+'GÖREVLENDİRME ONAYI'!G11","v":"Kadro  Der"},{"$f":"+'GÖREVLENDİRME ONAYI'!H11","v":"Yevmiye Tutarı"},{"$f":"+'GÖREVLENDİRME ONAYI'!I11","v":"Harcirah Ödeneği Bütçe Tertibi"},{"$f":"+'GÖREVLENDİRME ONAYI'!C16","v":"Gittiği Yerdeki Görevin Mahiyeti"},{"$f":"+'GÖREVLENDİRME ONAYI'!C21","v":"Geçici görevle görevlendirildiği şehir."},"Gidiş Tarihi","                    Dönüş Tarihi","Geçen Süre (Gün)",{"$f":"+'GÖREVLENDİRME ONAYI'!I24","v":"Gidiş Saati"},{"$f":"+'GÖREVLENDİRME ONAYI'!I26","v":"Dönüş Saati"},{"$f":"+'GÖREVLENDİRME ONAYI'!C28","v":"Bindiği vasıtanın cinsi"},{"$f":"+'GÖREVLENDİRME ONAYI'!E28","v":" Resmi vasıta ise  plaka nosu"},{"$f":"+'GÖREVLENDİRME ONAYI'!G28","v":"Şöförün adı ve soyadı"},"Otobüs Ücreti","Ek Gösterge","İlk Hareket"]
[null,{"$f":"+'GÖREVLENDİRME ONAYI'!I7","v":"00:00:00"},{"$f":"+'GÖREVLENDİRME ONAYI'!C13","v":"dkdkdk"},{"$f":"+'GÖREVLENDİRME ONAYI'!E13","v":"dsjasoj"},{"$f":"+'GÖREVLENDİRME ONAYI'!G13","v":""},{"$f":"+'GÖREVLENDİRME ONAYI'!H13","v":0},{"$f":"+'GÖREVLENDİRME ONAYI'!I13","v":0},{"$f":"+'GÖREVLENDİRME ONAYI'!E16","v":0},{"$f":"+'GÖREVLENDİRME ONAYI'!E21","v":0},{"$f":"+'GÖREVLENDİRME ONAYI'!G25","v":"00:00:00"},{"$f":"+'GÖREVLENDİRME ONAYI'!G27","v":"00:00:00"},null,{"$f":"+'GÖREVLENDİRME ONAYI'!J24","v":"00:00:00"},{"$f":"+'GÖREVLENDİRME ONAYI'!J26","v":"00:00:00"},{"$f":"+'GÖREVLENDİRME ONAYI'!C30","v":0},{"$f":"+'GÖREVLENDİRME ONAYI'!E30","v":0},{"$f":"+'GÖREVLENDİRME ONAYI'!G30","v":0},{"$f":"+'GÖREVLENDİRME ONAYI'!N25","v":0},{"$f":"+'GÖREVLENDİRME ONAYI'!G15","v":""},{"$f":"+'BİLGİ GİRİŞİ'!G14","v":0}]

{"sheet":"Saatler","index":7,"n_rows":25,"n_cols":13,"rows_kept":25,"cut":false,"hidden":false,"merged":[[3,0,11,0],[13,0,19,0],[23,1,23,12],[24,1,24,12],[2,1,2,3],[2,7,2,9],[21,1,21,12],[22,1,22,12]]}
[]
[]
[null,"Çıkış Saati Aşağıdaki Zaman Dilimi İçersinde",null,null,null,null,null,"Dönüş Saati Aşağıdaki Zaman Dilimi İçersinde",null,null,null,null,"Yevmiye"]
["Gece 00:01 ile Gündüz 12:59 Arası Çıkışlar","00:01:00","ile","12:59:00","Arası",null,null,"00:02:00","ile","12:59:00","Arası",null,0]
[]
[null,"00:01:00","ile","12:59:00","Arası",null,null,"13:01:00","ile","18:59:00","Arası",null,0.33333333333333331]
[]
[null,"00:01:00","ile","12:59:00","Arası",null,null,"13:01:00","ile","19:01:00","Arası",null,0.66666666666666663]
[]
[null,"00:01:00","ile","12:59:00","Arası",null,null,"00:01:00","ile","12:59:00","Arası","24 Saati Doldurmuşsa",1]
[]
[null,"00:01:00","ile","12:59:00","Arası",null,null,"00:01 + 00:01","ile","12:59 + 00:01","Arası","24 Saati Doldurmuş ve 24 Saati Aşan Kısmı Varsa",2]
[]
["Gündüz 13:01 ile Gece 00:00 Arası Çıkışlar","13:01:00","ile","18:59:00","Arası",null,null,"13:02:00","ile","18:59:00","Arası",null,0]
[]
[null,"13:01:00","ile","18:59:00","Arası",null,null,"19:00:00","ile","23:59:00","Arası",null,0.33333333333333331]
[]
[null,"13:01:00","ile","18:59:00","Arası",null,null,"19:00:00","ile","06:30:00","Arası","Çıktığı gün ile döndüğü gün takvim değişmiş ve geceyide geçirmiş ise",0.66666666666666663]
[]
[null,"19:01:00","ile",1,"Arası",null,null,"19:02:00","ile","06:30:00","Arası","Çıktığı gün ile döndüğü gün takvim değişmiş ve geceyide geçirmiş ise",0.33333333333333331]
[]
[null,"6245 HARCIRAH KANUNU (1)\n"]
[null,"Memuriyet mahalli dışına gönderilenlerin gündeliği:\n Madde 39 – (Değişik: 11/12/1981 - 2562/16 md.)\n             Resmi bir görevle memuriyet mahalli içinde bir yere gönderilenlere gündelik verilmez. Geçici bir görevle memuriyet mahalli dışındaki bir yere gönderilenlerden, buralarda ve yolda öğle (saat 13.00) ve akşam (saat 19.00) yemeği zamanlarından birini geçirenlere 1/3, ikisini geçirenlere 2/3 oranında ve geceyi de geçirenlere tam gündelik verilir.\n"]
[null,"1475 Sayılı İŞ KANUNU"]
[null,"GECE SÜRESİ: \n\nMADDE 65 — I — İş hayatında (Gece) en geç saat 20'de başlayarak en erken sabah 6'ya kadar geçen ve her halde en fazla 11 saat süren gün dönemidir. \n"]

{"sheet":"GORLIS","index":8,"n_rows":5,"n_cols":20,"rows_kept":5,"cut":false,"hidden":false,"merged":[]}
[]
[]
[null,"Evrak Tarihi",{"$f":"+'GÖREVLENDİRME ONAYI'!C12","v":"Adı Soyadı"},{"$f":"+'GÖREVLENDİRME ONAYI'!E12","v":"Görevi"},{"$f":"+'GÖREVLENDİRME ONAYI'!G11","v":"Kadro  Der"},{"$f":"+'GÖREVLENDİRME ONAYI'!H11","v":"Yevmiye Tutarı"},{"$f":"+'GÖREVLENDİRME ONAYI'!I11","v":"Harcirah Ödeneği Bütçe Tertibi"},{"$f":"+'GÖREVLENDİRME ONAYI'!C16","v":"Gittiği Yerdeki Görevin Mahiyeti"},{"$f":"+'GÖREVLENDİRME ONAYI'!C21","v":"Geçici görevle görevlendirildiği şehir."},"Gidiş Tarihi","                    Dönüş Tarihi","Geçen Süre (Gün)",{"$f":"+'GÖREVLENDİRME ONAYI'!I24","v":"Gidiş Saati"},{"$f":"+'GÖREVLENDİRME ONAYI'!I26","v":"Dönüş Saati"},{"$f":"+'GÖREVLENDİRME ONAYI'!C28","v":"Bindiği vasıtanın cinsi"},{"$f":"+'GÖREVLENDİRME ONAYI'!E28","v":" Resmi vasıta ise  plaka nosu"},{"$f":"+'GÖREVLENDİRME ONAYI'!G28","v":"Şöförün adı ve soyadı"},{"$f":"+'GÖREVLENDİRME ONAYI'!N24","v":"Otobüs Ücreti"},"Ek Göst","İlk Hareket"]
[null,"00:00:00","dkdkdk","dsjasoj","",0,0,0,0,"00:00:00","00:00:00",null,"00:00:00","00:00:00",0,0,0,0,"",0]
[null,"00:00:00","dkdkdk","dsjasoj","",0,0,0,0,"00:00:00","00:00:00",null,"00:00:00","00:00:00",0,0,0,0,"",0]